{"text_format":"1","workbook":"xlsx","n_sheets":11,"sheets":["Hinweise zum Programm","Auslegung","Bauakustik","Funktion","Maße","Datenblatt","Grunddaten","Lw","Dt","xkr._vx","Eingabe"],"not_rendered":{"charts":0,"images":19,"macros":1,"external_links":0,"defined_names":1,"comments":2,"pivot_tables":0},"unopened":[],"bounds":{"document_bytes":16777216,"sheet_cells":100000,"rows_first":2000,"rows_last":500,"rows_between":2000,"halvings":0,"cell_chars":16384,"cell_head_chars":4096},"cells_cut":0,"cells_raw":0,"read":"whole","date_system":"1900"}

{"sheet":"Hinweise zum Programm","index":0,"n_rows":22,"n_cols":1,"rows_kept":22,"cut":false,"hidden":false,"merged":[]}
["Hinweise zur Bedienung"]
[]
["Allgemeine Hinweise:"]
["Das Auslegungstool KSW dient als Hilfsmittel zur Technischen Planung des emcoair KSW. "]
[]
["Auslegung:"]
["Im Tabellenblatt \"Auslegung\" erfolgt die Festlegung des gewünschten Auslasstyps. Bei Eingabe der Vorgabedaten, wie z.B. dem benötigten Luftvolumenstrom werden die technischen Daten des gewählten Luftdurchlasses berechnet."]
[]
["Bauakustik:"]
["Im Tabellenblatt können die Auswirkungen des in eine Trennwand eingebauten Luftdurchlasses auf das Schalldämm-Maß des Gesamtsystems berechnet werden. Hierzu wird das resultierende Schalldämm-Maß nach DIN 4109 unter Berücksichtigung der Einzahlangaben (nach DIN EN ISO 717-1) und Flächenanteile bestimmt."]
[]
["Funktion:"]
["Im Tabellenblatt \"Funktion\" finden Sie eine kurze Funktionsbeschreibung zum emcoair KSW."]
[]
["Maße:"]
["Das Tabellenblatt \"Maße\" gibt einen Überblick über die wählbare Größen und Varianten des emcoair KSW mit detaillierten Bemaßungen."]
[]
["Hinweise zur Funktion:"]
["Für eine ordnungsgemäße Funktion des Auslegungstools muss die Ausführung von Makros und MS Excel aktiviert sein. Die Aktivierung von Makros erfolgt im Menü Makrosicherheit."]
["Einstellung unter MS Excel 97-2003: Extras → Makro → Sicherheit"]
["Einstellung unter MS Excel 2007: Entwicklertools* → Makrosicherheit  "]
["*Das Menü Entwicklertools muss unter Umständen eingefügt werden unter Excel-Optionen"]

{"sheet":"Auslegung","index":1,"n_rows":115,"n_cols":12,"rows_kept":115,"cut":false,"hidden":false,"merged":[[73,1,73,4],[71,1,71,4],[0,0,0,3],[90,3,90,4],[30,0,30,4],[35,3,35,4],[7,3,7,4],[5,0,5,4],[11,3,11,4],[17,3,17,4],[26,3,26,4],[28,3,28,4],[27,3,27,4],[6,3,6,4],[62,1,62,4],[68,1,68,4],[61,0,61,4],[21,3,21,4],[21,1,21,2],[35,1,35,2],[29,3,29,4],[60,3,60,4],[31,3,31,4],[32,3,32,4],[33,3,33,4],[34,3,34,4],[63,1,63,4],[67,1,67,4],[110,3,110,4],[111,3,111,4],[106,3,106,4],[107,3,107,4],[108,3,108,4],[109,3,109,4],[105,3,105,4],[103,3,103,4],[104,3,104,4],[91,3,91,4],[80,1,80,4],[84,4,87,4],[76,1,76,4]]}
["Auslegung Kombi-Schlitzdurchlass - emcoair KSW"]
[]
["Eingabefelder sind gelb gekennzeichnet"]
["Ergebnisfelder sind blau gekennzeichnet"]
[]
["Vorgaben"]
["Position","Symbol","Einheit","Wert"]
["Bezeichung","Symbol","Einheit","KSW"]
[null,"L","mm","KSW"]
[null,"L","mm"]
[null,"L","mm"]
["aktive Länge","L","mm",1000]
[null,null,null,500]
[null,null,null,800]
[null,null,null,1000]
[null,null,null,1200]
[]
["Schlitzanzahl","n","[-]",1]
[null,null,null,1]
[null,null,null,2]
[]
["Funktion",null,null,"Zuluft/Abluft-Kombination"]
[null,"Zuluft"]
[null,"Abluft"]
[null,{"$f":"IF(D12>500,\"Zuluft/Abluft-Kombination\",\"\")","v":"Zuluft/Abluft-Kombination"}]
[]
["Luftvolumenstrom Zuluft","V·SUP","m³/h",80]
["Luftvolumenstrom Abluft","V·ETA","m³/h",80]
["Temperatur Zuluft","tSUP","°C",22]
["Temperatur Raum","tRaum","°C",26]
["Raumdaten"]
["Raumhöhe","H1","m",3]
["Obergrenze Aufenthaltsbereich","H2","m",1.8]
["Raumlänge","LR","m",6]
["Raumbreite","BR","m",3]
["Raumart nach VDI 2081",null,null,"Einzelbüro"]
[null,null,"Einzelbüro"]
[null,null,"Großraumbüro"]
[null,null,"Werkstätten"]
[null,null,"Ruheraum, Pausenraum"]
[null,null,"Untersuchungsraum Krankenhaus"]
[null,null,"Rundfunk-, Fernsehstudio"]
[null,null,"Chemielabor"]
[null,null,"Wasch- und WC-Raum, Umkleide"]
[null,null,"Schwimmbad"]
[null,null,"EDV-Raum"]
[null,null,"Konzertsaal"]
[null,null,"Lesesaal"]
[null,null,"Museum"]
[null,null,"Küche"]
[null,null,"Theater, Kino"]
[null,null,"Klassen- Seminarraum"]
[null,null,"Gaststätte"]
[null,null,"kein Typ"]
[null,null,"Konferenzraum"]
[null,null,"Hotelzimmer"]
[null,null,"Hörsaal"]
[null,null,"Bettenzimmer Krankenhaus"]
[null,null,"Verkaufsraum"]
[null,null,"Sporthalle"]
["Abstand zur Schallquelle","r","m",3]
["Zusatzdaten",null,null,null,null,null,null,null,1,"Breite Anschlusskasten",{"$f":"Grunddaten!M49","v":1018},"mm"]
["Farbe Abdeckprofil und Endwinkel",9010,null,null,null,{"$f":"VLOOKUP(B63,Eingabe!A45:B48,2,FALSE)","v":{"$error":"#N/A"}},{"$f":"$B$63","v":9010},null,2,"sichtbare Breite Schlitzdurchlass",{"$f":"Grunddaten!N49","v":1030},"mm"]
["Farbe Luftlenkelement","schwarz",null,null,null,null,{"$f":"VLOOKUP(B64,B65:G67,6,FALSE)","v":"S"},null,3,"Höhe Anschlusskasten",{"$f":"Grunddaten!L49","v":280},"mm"]
[null,"schwarz",null,null,null,null,"S"]
[null,"weiß",null,null,null,null,"W"]
[null,"grau",null,null,null,null,"G"]
["Einstellung Luftlenkelement","Deckenstrahl D / E",null,null,null,null,{"$f":"VLOOKUP(B68,B69:G72,6,FALSE)","v":"D"},null,4,"Durchmesser Anschlussstutzen",{"$f":"Grunddaten!P49","v":98},"mm"]
[null,"Deckenstrahl D / E",null,null,null,null,"D"]
[null,"Sondereinstellung",null,null,null,null,"S"]
[]
["Werkstoff Anschlusskasten","Stahl verzinkt",null,null,null,null,"V",null,5,"Abstand Anschlussstutzen",{"$f":"Grunddaten!O49","v":508},"mm"]
[null,"Stahl verzinkt"]
["frontseitig bedienbare Drossel","ohne",null,null,null,{"$f":"VLOOKUP(B74,Eingabe!$A$45:$B$51,2,FALSE)","v":{"$error":"#N/A"}},{"$f":"VLOOKUP(B74,B75:G77,6,FALSE)","v":0},null,"* detaillierte Maße unter Tabellenblatt \"Maße\""]
[null,"mit",null,null,null,null,1]
[null,"ohne",null,null,null,null,0]
["Innenauskleidung","Baustoffklasse B1 (Standard)",null,null,null,null,{"$f":"VLOOKUP(B77,B78:G81,6,FALSE)","v":"B1"}]
[null,"Baustoffklasse B1 (Standard)",null,null,null,null,"B1"]
[null,"Baustoffklasse A2 (optional)",null,null,null,null,"A2"]
[]
["Merkmalschlüssel",{"$f":"CONCATENATE(1,\"KSW\",\"0\",D18,G81,#REF!,\"A\",G63,G64,G68,G72,G74,G77,1,G82)","v":{"$error":"#REF!"}},null,null,null,null,{"$f":"IF(D12<1000,CONCATENATE(0,D12),D12)","v":1000}]
[null,null,null,null,null,null,{"$f":"IF(K68=78,\"080\",100)","v":100}]
["Berechnung",null,null,"Zuluft","Abluft"]
["Druckverlust","Dpt","Pa",{"$f":"IF(OR(D22=\"Zuluft\",D22=\"Zuluft/Abluft-Kombination\"),Grunddaten!$K$49,\"\")","v":31.781000434290146},{"$f":"IF(OR(D22=\"Abluft\",D22=\"Zuluft/Abluft-Kombination\"),Grunddaten!$K$50,\"\")","v":33.176414210646051}]
["kritischer Strahlweg","xkr.","m",{"$f":"IF(OR(D22=\"Zuluft\",D22=\"Zuluft/Abluft-Kombination\"),IF($D$18=2,xkr._vx!$F$11,xkr._vx!$F$10),\"\")","v":">Raumlänge"}]
["Lauflänge bis Aufenthaltsbereich*","x+y","m",{"$f":"IF(OR(D22=\"Zuluft\",D22=\"Zuluft/Abluft-Kombination\"),IF($D$18=2,xkr._vx!$J$11,xkr._vx!$J$10),\"\")","v":7.2}]
["Geschwindigkeit im Aufenthaltsbereich*","vx+y","m/s",{"$f":"IF(OR(D22=\"Zuluft\",D22=\"Zuluft/Abluft-Kombination\"),IF(xkr._vx!$K$13<0.1,\"<0,1\",xkr._vx!$K$13),\"\")","v":0.15504530423086449}]
["Zugluftrisiko gemäß DIN EN ISO 7730","DR","%",{"$f":"IF(OR(D22=\"Zuluft\",D22=\"Zuluft/Abluft-Kombination\"),IF(D18=1,xkr._vx!M10,xkr._vx!M11),\"\")","v":12.022074000646736}]
["Schallleistungspegel Zuluft/Abluft","LWA_SUP/ETA","dB(A)",{"$f":"IF(OR(D22=\"Zuluft\",D22=\"Zuluft/Abluft-Kombination\"),Lw!I102,\"\")","v":34.039347775076777},{"$f":"IF(OR(D22=\"Abluft\",D22=\"Zuluft/Abluft-Kombination\"),Lw!I103,\"\")","v":37.729170629059723}]
[null,null,null,{"$f":"IF(OR(D89=\"<25\",D89=\"\"),0,D89)","v":34.039347775076777},{"$f":"IF(OR(E89=\"<25\",E89=\"\"),0,E89)","v":37.729170629059723}]
["Summen-Schallleistungspegel Zuluft + Abluft","LWA_gesamt","dB(A)",{"$f":"IF(D90+E90=0,\"25\",10*LOG(10^(0.1*D90)+10^(0.1*E90)))","v":39.27517617223404}]
["Schallldruckpegel im Raum","LPA","dB(A)",{"$f":"IF(D91+10*LOG(Lw!$F$110/(4*PI()*Auslegung!D61^2)+4/(Lw!$H$110))>=25,D91+10*LOG(Lw!$F$110/(4*PI()*Auslegung!D61^2)+4/(Lw!$H$110)),\"<25\")","v":33.467939004996495}]
["*Daten gelten für Walzenstellung D/E"]
[]
["Oktavspektrum Schallleistung","LW_Okt","dB",{"$f":"D83","v":"Zuluft"},{"$f":"E83","v":"Abluft"}]
[null,"LW_125","dB",{"$f":"IF(OR($D$22=\"Zuluft\",$D$22=\"Zuluft/Abluft-Kombination\"),Lw!B$104,\"\")","v":33.366776869275981},{"$f":"IF(OR($D$22=\"Abluft\",$D$22=\"Zuluft/Abluft-Kombination\"),Lw!B$105,\"\")","v":33.425883581011874}]
[null,"LW_250","dB",{"$f":"IF(OR($D$22=\"Zuluft\",$D$22=\"Zuluft/Abluft-Kombination\"),Lw!C$104,\"\")","v":37.588459975712304},{"$f":"IF(OR($D$22=\"Abluft\",$D$22=\"Zuluft/Abluft-Kombination\"),Lw!C$105,\"\")","v":40.690185876373867}]
[null,"LW_500","dB",{"$f":"IF(OR($D$22=\"Zuluft\",$D$22=\"Zuluft/Abluft-Kombination\"),Lw!D$104,\"\")","v":31.958452329811351},{"$f":"IF(OR($D$22=\"Abluft\",$D$22=\"Zuluft/Abluft-Kombination\"),Lw!D$105,\"\")","v":35.784945033166721}]
[null,"LW_1000","dB",{"$f":"IF(OR($D$22=\"Zuluft\",$D$22=\"Zuluft/Abluft-Kombination\"),Lw!E$104,\"\")","v":28.375388745910652},{"$f":"IF(OR($D$22=\"Abluft\",$D$22=\"Zuluft/Abluft-Kombination\"),Lw!E$105,\"\")","v":32.583760799792351}]
[null,"LW_2000","dB",{"$f":"IF(OR($D$22=\"Zuluft\",$D$22=\"Zuluft/Abluft-Kombination\"),Lw!F$104,\"\")","v":19.572259183534506},{"$f":"IF(OR($D$22=\"Abluft\",$D$22=\"Zuluft/Abluft-Kombination\"),Lw!F$105,\"\")","v":24.383960966485095}]
[null,"LW_4000","dB",{"$f":"IF(OR($D$22=\"Zuluft\",$D$22=\"Zuluft/Abluft-Kombination\"),Lw!G$104,\"\")","v":17.074849438026586},{"$f":"IF(OR($D$22=\"Abluft\",$D$22=\"Zuluft/Abluft-Kombination\"),Lw!G$105,\"\")","v":22.007237069098174}]
[null,"LW_8000","dB",{"$f":"IF(OR($D$22=\"Zuluft\",$D$22=\"Zuluft/Abluft-Kombination\"),Lw!H$104,\"\")","v":19.315367325443273},{"$f":"IF(OR($D$22=\"Abluft\",$D$22=\"Zuluft/Abluft-Kombination\"),Lw!H$105,\"\")","v":19.427380111617026}]
[]
["Durchgangsdämpfungsmaß","Dt","dB"]
[null,"Dt_63","dB",{"$f":"Dt!D$25","v":20.977177239036536}]
[null,"Dt_125","dB",{"$f":"Dt!E$25","v":11.594937881583789}]
[null,"Dt_250","dB",{"$f":"Dt!F$25","v":7.6860228153225307}]
[null,"Dt_500","dB",{"$f":"Dt!G$25","v":13.498963854887293}]
[null,"Dt_1000","dB",{"$f":"Dt!H$25","v":16.334390175814093}]
[null,"Dt_2000","dB",{"$f":"Dt!I$25","v":18.956656446592874}]
[null,"Dt_4000","dB",{"$f":"Dt!J$25","v":26.873813704830049}]
[null,"Dt_8000","dB",{"$f":"Dt!K$25","v":23.755415551971154}]
["Änderungen vorbehalten"]
["Stand:",null,null,null,{"$f":"IF(D12=500,KSW(),\"\")","v":""}]
[{"$f":"Grunddaten!E52","v":"2019-04-24"}]

{"sheet":"Bauakustik","index":2,"n_rows":53,"n_cols":5,"rows_kept":53,"cut":false,"hidden":false,"merged":[[3,0,3,3],[0,0,0,3],[8,0,8,3],[21,0,21,3],[28,0,28,3]]}
["Bauakustik - resultierendes Schalldämm-Maß"]
[]
["Erläuterung:"]
["Aus den Einzahlangaben der bewerteten Schalldämm-Maße nach DIN EN ISO 717-1 und den Flächenanteilen der Einzelelemente wird das resultierende Schalldämm-Maß R´W,R,res nach DIN 4109 berechnet."]
[]
["Eingabefelder sind gelb gekennzeichnet"]
["Ergebnisfelder sind blau gekennzeichnet"]
[]
["Vorgaben KSW"]
["Position","Symbol","Einheit","Wert"]
["gewählter Luftdurchlass",null,null,{"$f":"Auslegung!B81","v":{"$error":"#REF!"}}]
["aktive Länge","L","mm",{"$f":"Auslegung!D12","v":1000}]
["Schlitzanzahl","n","[-]",{"$f":"Auslegung!D18","v":1}]
["Breite Anschlusskasten","bAK","m",{"$f":"Auslegung!K62/1000","v":1.018}]
["Höhe Anschlusskasten","hAK","m",{"$f":"Auslegung!K64/1000","v":0.28000000000000003}]
["Bezugsfläche KSW für die Berechnung","SAK","m²",{"$f":"D14*D15","v":0.28504000000000002}]
["Abluft an Kanal angeschlossen?",null,null,"ja"]
[null,null,null,"ja"]
[null,null,null,"nein"]
["Schalldämm-Maß emcoair KSW","RW_AK","dB",{"$f":"IF(D17=\"ja\",Grunddaten!T49,Grunddaten!V49)","v":36.549058093429593}]
[]
["Vorgaben Trennwand"]
["Position","Symbol","Einheit","Wert"]
["Breite Trennwand","bE1","m",5]
["Höhe Trennwand","hE1","m",3]
["Fläche Trennwand exklusive Einbauten","SE1","m²",{"$f":"D24*D25-D33-D16","v":14.71496}]
["Schalldämm-Maß der Trennwand","RW_E1","dB",40]
[]
["Vorgaben weitere Bauteile im System (Tür, Fenster, …)"]
["Position","Symbol","Einheit","Wert"]
["Breite Element","bE2","m",0]
["Höhe Element","hE2","m",0]
["Fläche Element","SE2","m²",{"$f":"D31*D32","v":0}]
["Schalldämm-Maß Element","RW_E2","dB",0]
[]
["resultierendes Schalldämmmaß des Gesamtsystems","R´W,R,res","dB",{"$f":"-10*LOG(1/(D33+D26+D16)*($D$16*10^(-0.1*$D$20)+$D$26*10^(-0.1*$D$27)+$D$33*10^(-0.1*$D$34)))","v":39.900984043629222}]
[]
[]
[]
[]
[]
[]
[]
[]
[]
[]
[]
[]
[]
[]
[]
[null,null,null,null,"technische Änderungen vorbehalten"]
[null,null,null,"Stand:",{"$f":"Grunddaten!$E$52","v":"2019-04-24"}]

{"sheet":"Funktion","index":3,"n_rows":0,"n_cols":0,"rows_kept":0,"cut":false,"hidden":false,"merged":[]}

{"sheet":"Maße","index":4,"n_rows":0,"n_cols":0,"rows_kept":0,"cut":false,"hidden":false,"merged":[]}

{"sheet":"Datenblatt","index":5,"n_rows":40,"n_cols":9,"rows_kept":40,"cut":false,"hidden":false,"merged":[[27,2,27,3],[9,0,9,8],[16,6,16,7],[1,1,1,7],[26,2,26,3],[24,5,24,6],[25,5,25,6],[26,5,26,6],[27,5,27,6]]}
[]
["Typ","KSW",null,null,null,null,null,null,{"$f":"TODAY()","v":"2019-04-24"}]
["Projekt","bitte Projektname / VIS-Nr. eintragen"]
[]
["Definition:"]
["aktive Länge:",{"$f":"Auslegung!D12","v":1000},"Farbe Walzen:",null,{"$f":"Auslegung!B64","v":"schwarz"},"Funktion:",{"$f":"Auslegung!D22","v":"Zuluft/Abluft-Kombination"}]
["Schlitzanzahl:",{"$f":"Auslegung!D18","v":1},"Farbe Abdeckprofil:",null,{"$f":"Auslegung!B63","v":9010}]
["Innenauskleidung:",{"$f":"Auslegung!G77","v":"B1"},"Drossel fb:",null,{"$f":"Auslegung!B74","v":"ohne"}]
[]
["Beschreibung:\nVerstellbarer Luftdurchlass für den Einbau in Leichtbauwänden (z.B. Trockenbau).\nZuluft- und Abluftfunktion in einer Frontblende (außer KSW500).\nAusgestattet mit im Anschlusskasten integriertem Absorptionsmaterial nach VDI6022, zur Minderung der Telefonieschallübertragung.\nVariable Luftlenkung durch integrierte Luftleitelemente (Exzenterwalze)."]
[]
[]
["technische Vorgaben",null,null,null,null,"Raumdaten"]
["Luftvolumenstrom Zuluft","V·SUP",{"$f":"Auslegung!D27","v":80},"m³/h",null,"Raumhöhe",{"$f":"Auslegung!D32","v":3},"m"]
[{"$f":"IF(B6=500,\" \",\"Luftvolumenstrom Abluft\")","v":"Luftvolumenstrom Abluft"},"V·ETA",{"$f":"IF(B6=500,\"\",Auslegung!D28)","v":80},{"$f":"IF(B6=500,\"\",\"m³/h\")","v":"m³/h"},null,"Raumbreite ",{"$f":"Auslegung!D35","v":3},"m"]
["Temperatur Zuluft","tZUL",{"$f":"Auslegung!D29","v":22},"°C",null,"Raumlänge",{"$f":"Auslegung!D34","v":6},"m"]
["Temperatur Raum","tRAUM",{"$f":"Auslegung!D30","v":26},"°C",null,"Nutzungsart",{"$f":"Auslegung!D36","v":"Einzelbüro"}]
[]
[]
["technische Daten",null,{"$f":"IF(B6=500,\"Zuluft/Abluft\",\"Zuluft\")","v":"Zuluft"},{"$f":"IF(B6=500,\" \",\"Abluft\")","v":"Abluft"}]
["Druckverlust","Dp",{"$f":"Auslegung!D84","v":31.781000434290146},{"$f":"Auslegung!E84","v":33.176414210646051},"Pa"]
["kritischer Strahlweg","xkr.",{"$f":"Auslegung!D85","v":">Raumlänge"},null,"m"]
["Lauflänge bis in den Aufenthaltsbereich","x+y",{"$f":"Auslegung!D86","v":7.2},null,"m"]
["Geschwindigkeit im Aufenthaltsbereich","vx+y",{"$f":"Auslegung!D87","v":0.15504530423086449},null,"m/s","Maße"]
["Zugluftrisiko gemäß \nDIN EN ISO 7730**","DR",{"$f":"Auslegung!D88","v":12.022074000646736},null,"%",{"$f":"Auslegung!J62","v":"Breite Anschlusskasten"},null,{"$f":"Auslegung!K62","v":1018},"mm"]
["Schallleistungspegel","LWA_SUP/ETA",{"$f":"Auslegung!D89","v":34.039347775076777},{"$f":"Auslegung!E89","v":37.729170629059723},"dB(A)",{"$f":"Auslegung!J63","v":"sichtbare Breite Schlitzdurchlass"},null,{"$f":"Auslegung!K63","v":1030},"mm"]
["Summen-Schallleistungspegel","LWA_gesamt",{"$f":"Auslegung!D91","v":39.27517617223404},null,null,{"$f":"Auslegung!J64","v":"Höhe Anschlusskasten"},null,{"$f":"Auslegung!K64","v":280},"mm"]
[{"$f":"CONCATENATE(\"Schalldruckpegel in \",Auslegung!D61,\" m Abstand\")","v":"Schalldruckpegel in 3 m Abstand"},"LPA",{"$f":"Auslegung!D92","v":33.467939004996495},null,"dB(A)",{"$f":"Auslegung!J68","v":"Durchmesser Anschlussstutzen"},null,{"$f":"Auslegung!K68","v":98},"mm"]
["*Daten gelten für Walzenstellung D/E"]
["** Raumkategorie nach DIN EN ISO 7730: DR<10 % = A; DR<20 % = B; DR<30 % = C"]
[]
[]
["Oktavspektrum Schallleistungspegel","f [Hz]",125,250,500,1000,2000,4000,8000]
[{"$f":"IF(B6=500,\"Zuluft/Abluft\",\"Zuluft\")","v":"Zuluft"},"LWA_Okt",{"$f":"Auslegung!D96","v":33.366776869275981},{"$f":"Auslegung!D97","v":37.588459975712304},{"$f":"Auslegung!D98","v":31.958452329811351},{"$f":"Auslegung!D99","v":28.375388745910652},{"$f":"Auslegung!D100","v":19.572259183534506},{"$f":"Auslegung!D101","v":17.074849438026586},{"$f":"Auslegung!D102","v":19.315367325443273}]
["Abluft","LWA_Okt",{"$f":"Auslegung!E96","v":33.425883581011874},{"$f":"Auslegung!E97","v":40.690185876373867},{"$f":"Auslegung!E98","v":35.784945033166721},{"$f":"Auslegung!E99","v":32.583760799792351},{"$f":"Auslegung!E100","v":24.383960966485095},{"$f":"Auslegung!E101","v":22.007237069098174},{"$f":"Auslegung!E102","v":19.427380111617026}]
[]
["Durchgangsdämpfungs-maß","f [Hz]",125,250,500,1000,2000,4000,8000]
["Zuluft / Abluft","Dt",{"$f":"Auslegung!D105","v":20.977177239036536},{"$f":"Auslegung!D107","v":7.6860228153225307},{"$f":"Auslegung!D108","v":13.498963854887293},{"$f":"Auslegung!D109","v":16.334390175814093},{"$f":"Auslegung!D110","v":18.956656446592874},{"$f":"Auslegung!D111","v":26.873813704830049},{"$f":"Auslegung!D112","v":23.755415551971154}]
[null,null,null,null,null,null,null,null,"technische Änderungen vorbehalten"]
[null,null,null,null,null,null,null,"Stand:",{"$f":"Grunddaten!E52","v":"2019-04-24"}]

{"sheet":"Grunddaten","index":6,"n_rows":52,"n_cols":22,"rows_kept":52,"cut":false,"hidden":true,"merged":[]}
["Typ",null,null,"Baulänge","Schlitzanzahl","Schlitzlänge","spez.Volumenstrom","Widerstandsbeiwert","Durchmesser Anschluss","Anströmgeschwindigkeit","Druckverlust","Höhe Anschlusskasten","Breite Anschlusskasten","sichtbare Breit Schlitzdurchlass","Abstand Zuluft/Abluft","Durchmesser Anschlussstutzen","Norm-Schallpegeldifferenz","Schalldämm-Maß","Norm-Schallpegeldifferenz","Schalldämm-Maß","Norm-Schallpegeldifferenz","Schalldämm-Maß"]
[null,null,null,"l","n","L","V°spez","z","d","v","Dp","h","b","b1","x","D","Dn,w","Rw","Dn,w","Rw","Dn,w","Rw"]
[null,null,null,"mm",1,"mm","m³/(h·Walze)",1,"mm","m/s","Pa","mm","mm","mm","mm","mm","dB","dB","dB","dB","dB","dB"]
["KSW","ZUL",{"$f":"CONCATENATE(A4,B4,D4,E4)","v":"KSWZUL5001"},500,1,{"$f":"D4*E4","v":500},{"$f":"Auslegung!$D$27/(0.01*Grunddaten!F4)","v":16},4.0195437362021975,80,{"$f":"Auslegung!$D$27/(PI()/4*(Grunddaten!I4/1000)^2*3600)","v":4.4209706414415368},{"$f":"H4*1.2/2*J4^2","v":47.13714456645269},280,518,530,"-",78,43,{"$f":"Q4+10*LOG(($L4/1000*$M4/1000)/10)","v":24.614877910874522},53,{"$f":"S4+10*LOG(($L4/1000*$M4/1000)/10)","v":34.614877910874526},"-","-"]
["KSW","ZUL","KSWZUL8001",800,1,{"$f":"D5/2*E5","v":400},{"$f":"Auslegung!$D$27/(0.01*Grunddaten!F5)","v":20},4.9425238432329737,80,{"$f":"Auslegung!$D$27/(PI()/4*(Grunddaten!I5/1000)^2*3600)","v":4.4209706414415368},{"$f":"H5*1.2/2*J5^2","v":57.960921988060306},280,818,830,408,78,42,25.599113350135422,52,35.599113350135426,44,{"$f":"U5+10*LOG(($L5/1000*$M5/1000)/10)","v":27.599113350135422}]
["KSW","ZUL","KSWZUL10001",1000,1,{"$f":"D6/2*E6","v":500},{"$f":"Auslegung!$D$27/(0.01*Grunddaten!F6)","v":16},6.6163901151928988,100,{"$f":"Auslegung!$D$27/(PI()/4*(Grunddaten!I6/1000)^2*3600)","v":2.8294212105225833},31.781000434290146,280,1018,1030,508,98,42,26.549058093429593,52,36.549058093429593,43,{"$f":"U6+10*LOG(($L6/1000*$M6/1000)/10)","v":27.549058093429593}]
["KSW","ZUL","KSWZUL12001",1200,1,{"$f":"D7/2*E7","v":600},{"$f":"Auslegung!$D$27/(0.01*Grunddaten!F7)","v":13.333333333333334},5.5901181932007376,100,{"$f":"Auslegung!$D$27/(PI()/4*(Grunddaten!I7/1000)^2*3600)","v":2.8294212105225833},26.851431918727826,280,1218,1230,608,98,42,27.328053196390758,52,37.328053196390755,43,{"$f":"U7+10*LOG(($L7/1000*$M7/1000)/10)","v":28.328053196390758}]
["KSW","ZUL","KSWZUL5002",500,2,{"$f":"D8*E8","v":1000},{"$f":"Auslegung!$D$27/(0.01*Grunddaten!F8)","v":8},3.9599037734933606,100,{"$f":"Auslegung!$D$27/(PI()/4*(Grunddaten!I8/1000)^2*3600)","v":2.8294212105225833},19.02090133049396,280,518,530,"-",98,43,24.614877910874522,53,34.614877910874526,"-","-"]
["KSW","ZUL","KSWZUL8002",800,2,{"$f":"D9/2*E9","v":800},{"$f":"Auslegung!$D$27/(0.01*Grunddaten!F9)","v":10},3.0535716101476651,80,{"$f":"Auslegung!$D$27/(PI()/4*(Grunddaten!I9/1000)^2*3600)","v":4.4209706414415368},35.809200217222283,280,818,830,408,78,41,24.599113350135422,52,35.599113350135426,44,{"$f":"U9+10*LOG(($L9/1000*$M9/1000)/10)","v":27.599113350135422}]
["KSW","ZUL","KSWZUL10002",1000,2,{"$f":"D10/2*E10","v":1000},{"$f":"Auslegung!$D$27/(0.01*Grunddaten!F10)","v":8},3.8156436993722296,100,{"$f":"Auslegung!$D$27/(PI()/4*(Grunddaten!I10/1000)^2*3600)","v":2.8294212105225833},18.327966150059737,280,1018,1030,508,98,41,25.549058093429593,52,36.549058093429593,43,{"$f":"U10+10*LOG(($L10/1000*$M10/1000)/10)","v":27.549058093429593}]
["KSW","ZUL","KSWZUL12002",1200,2,{"$f":"D11/2*E11","v":1200},{"$f":"Auslegung!$D$27/(0.01*Grunddaten!F11)","v":6.666666666666667},3.4023804178958623,100,{"$f":"Auslegung!$D$27/(PI()/4*(Grunddaten!I11/1000)^2*3600)","v":2.8294212105225833},16.342907787506746,280,1218,1230,608,98,41,26.328053196390758,52,37.328053196390755,43,{"$f":"U11+10*LOG(($L11/1000*$M11/1000)/10)","v":28.328053196390758}]
["KSW","ABL","KSWABL5001",500,1,{"$f":"D12*E12","v":500},{"$f":"Auslegung!$D$28/(0.01*Grunddaten!F12)","v":16},4.0152854881447197,80,{"$f":"Auslegung!$D$28/(PI()/4*(Grunddaten!I12/1000)^2*3600)","v":4.4209706414415368},47.087208138972791,280,518,530,"-",78,43,{"$f":"Q12+10*LOG(($L12/1000*$M12/1000)/10)","v":24.614877910874522},53,{"$f":"S12+10*LOG(($L12/1000*$M12/1000)/10)","v":34.614877910874526},"-","-"]
["KSW","ABL","KSWABL8001",800,1,{"$f":"D13/2*E13","v":400},{"$f":"Auslegung!$D$28/(0.01*Grunddaten!F13)","v":20},4.9963459953949281,80,{"$f":"Auslegung!$D$28/(PI()/4*(Grunddaten!I13/1000)^2*3600)","v":4.4209706414415368},58.592093766211605,280,818,830,408,78,42,25.599113350135422,52,35.599113350135426,44,{"$f":"U13+10*LOG(($L13/1000*$M13/1000)/10)","v":27.599113350135422}]
["KSW","ABL","KSWABL10001",1000,1,{"$f":"D14/2*E14","v":500},{"$f":"Auslegung!$D$28/(0.01*Grunddaten!F14)","v":16},6.9068970781682886,100,{"$f":"Auslegung!$D$28/(PI()/4*(Grunddaten!I14/1000)^2*3600)","v":2.8294212105225833},33.176414210646051,280,1018,1030,508,98,42,26.549058093429593,52,36.549058093429593,43,{"$f":"U14+10*LOG(($L14/1000*$M14/1000)/10)","v":27.549058093429593}]
["KSW","ABL","KSWABL12001",1200,1,{"$f":"D15/2*E15","v":600},{"$f":"Auslegung!$D$28/(0.01*Grunddaten!F15)","v":13.333333333333334},5.7981370374523573,100,{"$f":"Auslegung!$D$28/(PI()/4*(Grunddaten!I15/1000)^2*3600)","v":2.8294212105225833},27.850624358170091,280,1218,1230,608,98,42,27.328053196390758,52,37.328053196390755,43,{"$f":"U15+10*LOG(($L15/1000*$M15/1000)/10)","v":28.328053196390758}]
["KSW","ABL","KSWABL5002",500,2,{"$f":"D16*E16","v":1000},{"$f":"Auslegung!$D$28/(0.01*Grunddaten!F16)","v":8},3.8052344572874013,100,{"$f":"Auslegung!$D$28/(PI()/4*(Grunddaten!I16/1000)^2*3600)","v":2.8294212105225833},18.277966660691821,280,518,530,"-",98,43,24.614877910874522,53,34.614877910874526,"-","-"]
["KSW","ABL","KSWABL8002",800,2,{"$f":"D17/2*E17","v":800},{"$f":"Auslegung!$D$28/(0.01*Grunddaten!F17)","v":10},2.95387868560536,80,{"$f":"Auslegung!$D$28/(PI()/4*(Grunddaten!I17/1000)^2*3600)","v":4.4209706414415368},{"$f":"H17*1.2/2*J17^2","v":34.640102402940734},280,818,830,408,78,41,24.599113350135422,52,35.599113350135426,44,{"$f":"U17+10*LOG(($L17/1000*$M17/1000)/10)","v":27.599113350135422}]
["KSW","ABL","KSWABL10002",1000,2,{"$f":"D18/2*E18","v":1000},{"$f":"Auslegung!$D$28/(0.01*Grunddaten!F18)","v":8},3.8123628428332599,100,{"$f":"Auslegung!$D$28/(PI()/4*(Grunddaten!I18/1000)^2*3600)","v":2.8294212105225833},{"$f":"H18*1.2/2*J18^2","v":18.312206966989439},280,1018,1030,508,98,41,25.549058093429593,52,36.549058093429593,43,27.549058093429593]
["KSW","ABL","KSWABL12002",1200,2,{"$f":"D19/2*E19","v":1200},{"$f":"Auslegung!$D$28/(0.01*Grunddaten!F19)","v":6.666666666666667},3.3772942608738101,100,{"$f":"Auslegung!$D$28/(PI()/4*(Grunddaten!I19/1000)^2*3600)","v":2.8294212105225833},16.222409577254336,280,1218,1230,608,98,41,26.328053196390758,52,37.328053196390755,43,28.328053196390758]
["KSW-1LW","ZUL","KSW-1LWZUL8001",800,1,800,{"$f":"Auslegung!$D$27/(0.01*Grunddaten!F20)","v":10},6.7861986545717388,80,{"$f":"(Auslegung!$D$27/2)/(PI()/4*(Grunddaten!I20/1000)^2*3600)","v":2.2104853207207684},{"$f":"H20*1.2/2*J20^2","v":19.895418984758347},280,818,830,408,78,42,{"$f":"Q20+10*LOG(($L20/1000*$M20/1000)/10)","v":25.599113350135422},52,{"$f":"S20+10*LOG(($L20/1000*$M20/1000)/10)","v":35.599113350135426},44,27.599113350135422]
["KSW-1LW","ZUL","KSW-1LWZUL10001",1000,1,1000,{"$f":"Auslegung!$D$27/(0.01*Grunddaten!F21)","v":8},12.811266431947837,100,{"$f":"(Auslegung!$D$27/2)/(PI()/4*(Grunddaten!I21/1000)^2*3600)","v":1.4147106052612917},15.384328045538414,280,1018,1030,508,98,42,26.549058093429593,52,36.549058093429593,43,27.549058093429593]
["KSW-1LW","ZUL","KSW-1LWZUL12001",1200,1,1200,{"$f":"Auslegung!$D$27/(0.01*Grunddaten!F22)","v":6.666666666666667},8.7245947882339827,100,{"$f":"(Auslegung!$D$27/2)/(PI()/4*(Grunddaten!I22/1000)^2*3600)","v":1.4147106052612917},10.476874319924599,280,1218,1230,608,98,42,27.328053196390758,52,37.328053196390755,43,28.328053196390758]
["KSW-1LW","ZUL","KSW-1LWZUL8002",800,2,1600,{"$f":"Auslegung!$D$27/(0.01*Grunddaten!F23)","v":5},2.4960278124191633,80,{"$f":"(Auslegung!$D$27/2)/(PI()/4*(Grunddaten!I23/1000)^2*3600)","v":2.2104853207207684},7.3177225798178416,280,818,830,408,78,41,24.599113350135422,52,35.599113350135426,44,27.599113350135422]
["KSW-1LW","ZUL","KSW-1LWZUL10002",1000,2,2000,{"$f":"Auslegung!$D$27/(0.01*Grunddaten!F24)","v":4},4.6871392731822699,100,{"$f":"(Auslegung!$D$27/2)/(PI()/4*(Grunddaten!I24/1000)^2*3600)","v":1.4147106052612917},5.6285214702852047,280,1018,1030,508,98,41,25.549058093429593,52,36.549058093429593,43,27.549058093429593]
["KSW-1LW","ZUL","KSW-1LWZUL12002",1200,2,2400,{"$f":"Auslegung!$D$27/(0.01*Grunddaten!F25)","v":3.3333333333333335},7.3466892269668431,100,{"$f":"(Auslegung!$D$27/2)/(PI()/4*(Grunddaten!I25/1000)^2*3600)","v":1.4147106052612917},{"$f":"H25*1.2/2*J25^2","v":8.8222251653770876},280,1218,1230,608,98,41,26.328053196390758,52,37.328053196390755,43,28.328053196390758]
["KSW-1LW","ABL","KSW-1LWABL8001",800,1,800,{"$f":"Auslegung!$D$28/(0.01*Grunddaten!F26)","v":10},5.8282497463447092,80,{"$f":"(Auslegung!$D$28/2)/(PI()/4*(Grunddaten!I26/1000)^2*3600)","v":2.2104853207207684},{"$f":"H26*1.2/2*J26^2","v":17.086954943946779},280,818,830,408,78,42,{"$f":"Q26+10*LOG(($L26/1000*$M26/1000)/10)","v":25.599113350135422},52,{"$f":"S26+10*LOG(($L26/1000*$M26/1000)/10)","v":35.599113350135426},44,27.599113350135422]
["KSW-1LW","ABL","KSW-1LWABL10001",1000,1,1000,{"$f":"Auslegung!$D$28/(0.01*Grunddaten!F27)","v":8},12.569476757521571,100,{"$f":"(Auslegung!$D$28/2)/(PI()/4*(Grunddaten!I27/1000)^2*3600)","v":1.4147106052612917},15.093976448437795,280,1018,1030,508,98,42,26.549058093429593,52,36.549058093429593,43,27.549058093429593]
["KSW-1LW","ABL","KSW-1LWABL12001",1200,1,1200,{"$f":"Auslegung!$D$28/(0.01*Grunddaten!F28)","v":6.666666666666667},10.843704645347458,100,{"$f":"(Auslegung!$D$28/2)/(PI()/4*(Grunddaten!I28/1000)^2*3600)","v":1.4147106052612917},13.021593952409132,280,1218,1230,608,98,42,27.328053196390758,52,37.328053196390755,43,28.328053196390758]
["KSW-1LW","ABL","KSW-1LWABL8002",800,2,1600,{"$f":"Auslegung!$D$28/(0.01*Grunddaten!F29)","v":5},4.6731051664241816,80,{"$f":"(Auslegung!$D$28/2)/(PI()/4*(Grunddaten!I29/1000)^2*3600)","v":2.2104853207207684},13.700363042454335,280,818,830,408,78,41,24.599113350135422,52,35.599113350135426,44,27.599113350135422]
["KSW-1LW","ABL","KSW-1LWABL10002",1000,2,2000,{"$f":"Auslegung!$D$28/(0.01*Grunddaten!F30)","v":4},5.1649642113313821,100,{"$f":"(Auslegung!$D$28/2)/(PI()/4*(Grunddaten!I30/1000)^2*3600)","v":1.4147106052612917},6.2023145168878111,280,1018,1030,508,98,41,25.549058093429593,52,36.549058093429593,43,27.549058093429593]
["KSW-1LW","ABL","KSW-1LWABL12002",1200,2,2400,{"$f":"Auslegung!$D$28/(0.01*Grunddaten!F31)","v":3.3333333333333335},6.173672558458823,100,{"$f":"(Auslegung!$D$28/2)/(PI()/4*(Grunddaten!I31/1000)^2*3600)","v":1.4147106052612917},7.4136155382905766,280,1218,1230,608,98,41,26.328053196390758,52,37.328053196390755,43,28.328053196390758]
[]
[]
[]
[]
[]
[]
[null,null,null,2,3,4,5,6,7,8,9,10,11,12,13,14,15,16,17,18,19,20]
[]
["Verklausulierung:"]
[]
[]
["Länge:",{"$f":"Auslegung!D12","v":1000},null,{"$f":"IF(B43=500,\"KSW\",IF(AND(B43>500,C44=3),\"KSW\",\"KSW-1LW\"))","v":"KSW"}]
["Funktion:",{"$f":"Auslegung!D22","v":"Zuluft/Abluft-Kombination"},{"$f":"IF(B44=\"Zuluft\",1,IF(B44=\"Abluft\",2,IF(B44=\"Zuluft/Abluft-Kombination\",3,\"\")))","v":3},{"$f":"IF($B$44=\"Zuluft\",\"ZUL\",IF($B$44=\"Abluft\",\"ABL\",IF(AND($B$44=\"Zuluft\",$D$43=\"KSW-1LW\"),\"ZUL\",IF(AND($B$44=\"Abluft\",$D$43=\"KSW-1LW\"),\"ABL\",\"ZUL\"))))","v":"ZUL"}]
[null,null,null,{"$f":"IF($B$44=\"Zuluft\",\"ZUL\",IF($B$44=\"Abluft\",\"ABL\",IF(AND($B$44=\"Zuluft\",$D$43=\"KSW-1LW\"),\"ZUL\",IF(AND($B$44=\"Abluft\",$D$43=\"KSW-1LW\"),\"ABL\",\"ABL\"))))","v":"ABL"}]
[]
[]
[]
["Auswahl:","Zuluft",{"$f":"CONCATENATE(D43,D44,Auslegung!$D$12,Auslegung!$D$18)","v":"KSWZUL10001"},{"$f":"VLOOKUP($C$49,$C$4:$L$31,D38,FALSE)","v":1000},{"$f":"VLOOKUP($C$49,$C$4:$L$31,E38,FALSE)","v":1},500,16,6.6163901151928988,100,2.8294212105225833,31.781000434290146,280,{"$f":"VLOOKUP($C$49,$C$4:$V$31,M38,FALSE)","v":1018},{"$f":"VLOOKUP($C$49,$C$4:$V$31,N38,FALSE)","v":1030},508,98,42,26.549058093429593,52,36.549058093429593,43,27.549058093429593]
[null,"Abluft",{"$f":"CONCATENATE(D43,D45,Auslegung!$D$12,Auslegung!$D$18)","v":"KSWABL10001"},{"$f":"VLOOKUP($C$50,$C$4:$L$31,D38,FALSE)","v":1000},{"$f":"VLOOKUP($C$50,$C$4:$L$31,E38,FALSE)","v":1},500,16,6.9068970781682886,100,2.8294212105225833,33.176414210646051,280,{"$f":"VLOOKUP($C$50,$C$4:$V$31,M38,FALSE)","v":1018},{"$f":"VLOOKUP($C$50,$C$4:$V$31,N38,FALSE)","v":1030},508,98,42,26.549058093429593,52,36.549058093429593,43,27.549058093429593]
[null,null,null,null,null,null,null,null,null,null,null,null,null,null,null,null,"offen",null,"geschlossen",null,"ZUL geschlossen, ABL offen"]
[null,null,null,"Stand:","2019-04-24"]

{"sheet":"Lw","index":7,"n_rows":132,"n_cols":23,"rows_kept":132,"cut":false,"hidden":true,"merged":[[114,0,114,1],[69,1,69,7],[1,1,1,21],[37,1,37,21],[106,0,106,2],[107,0,107,1],[108,0,108,1],[109,0,109,1],[110,0,110,1],[111,0,111,1],[112,0,112,1],[113,0,113,1],[126,0,126,1],[115,0,115,1],[116,0,116,1],[117,0,117,1],[118,0,118,1],[119,0,119,1],[120,0,120,1],[121,0,121,1],[122,0,122,1],[123,0,123,1],[124,0,124,1],[125,0,125,1],[131,0,131,1],[127,0,127,1],[128,0,128,1],[129,0,129,1],[130,0,130,1]]}
[]
[null,"Terzfrequenzband fm [Hz]"]
[null,100,125,160,200,250,315,400,500,630,800,1000,1250,1600,2000,2500,3150,4000,5000,6300,8000,10000]
["KSD-WZUL1",-87.0256630421339,-101.10667780523316,-96.401653588340167,-83.866675298209074,-75.70483128290428,-94.965045071129722,-79.623937273152592,-60.346799592251834,-93.256584639159712,-92.221464017842791,-90.483577394103918,-72.566422264836589,-48.308547856852606,-31.716838745014329,-30.380546431271643,-6.2396233943883894,5.7748510983634249,13.973355633592046,16.343188319820907,14.461451436360276,15.130965354123896]
[null,15.880895836068152,21.673086476222373,37.974632610785477,47.276074861632878,53.989474335403415,56.454251000485861,51.603035885707648,54.102563647760547,68.032395017851172,71.388800066071184,71.483883207249903,64.384158383205701,56.034252846771935,47.225361099874462,40.412408066347311,28.411256213300387,15.720706198491905,7.8720769157617871,2.7254897925403716,0.49093006928434046,0.20263448973522349]
[null,30.597104349666253,36.175916944880136,28.031693342744987,22.100779380466118,15.982822720822355,21.227493436991299,16.842897752378942,10.173479882101152,18.064646641299795,14.956184981583323,15.553725705875319,9.9878346348530833,3.8835648170793138,0.12941763008375853,2.7759806386107249,-2.3188453784415892,-3.0537747843447778,-3.5560134722489192,-2.2352880287342005,-0.30683549056919712,-4.432493087320627E-2]
[null,-3.6044370905962726,-14.000545767532033,-13.314699092266721,-14.269798960411718,-8.4536892306504807,-6.5501836539163687,-5.7176869967570552,-12.268952880837444,-14.258288459012293,-9.9878588123201109,-17.532264219021258,-15.083950332335636,-15.586102817601779,-12.263042809696648,-12.435564496917708,-8.9893861143659208,-4.0386761200379571,-2.0757877907814142,-1.3082043711326445,-1.3047683726382695,-0.99808569551810478]
["KSD-WZUL2",-52.042256898000552,-101.33337797797796,-158.24106166629733,-145.46455399008462,-92.670786511635626,-79.513067776115889,-91.865289698594154,-98.55717604244046,-145.05166927995967,-159.01612926206997,-158.25590724392498,-150.41116934898531,-129.16116186149179,-111.97487469032322,-94.399335285357537,-67.716643955164457,-39.27673764092394,-27.683268734710907,-19.049239363612628,-15.400387620169584,-12.917093165315329]
[null,11.071442636376633,21.309232270069248,36.922476034174508,46.951245891317839,51.702852029669863,54.215255915106162,53.678507917457203,59.373171430220687,67.525648383612918,73.397414259878374,77.800081121878634,75.192224542090102,69.498043067926417,60.515313829841574,50.5646988813562,35.402394137410838,21.135613255016867,10.420989910125757,3.6616374122042403,0.91960825754116549,0.5630685347339387]
[null,15.852817361110997,32.45877409656557,44.653254975523993,45.238428987840329,26.086460088008774,23.09939099270839,25.600385406469876,23.325939057355914,35.915464600675186,38.729404059689749,36.230415829175548,34.455345540625132,30.344373298129739,26.77967744016324,22.398075027953873,16.539098262001275,9.6058534677948071,8.2721758964429029,7.7289872347640758,7.5665208058357001,7.3996914472831827]
[null,11.11610141987552,-8.1969244311373402,1.8321184017510488,-32.751890859479765,-23.179202361450638,-33.4235274768781,-25.730840892873868,-13.113077840210741,-10.641618614556242,-11.135638387025251,-9.3054005670129687,-13.269449354983028,-23.311839176264233,-22.327552020361971,-13.141265924556283,-5.2718151422845763,4.2834296250990027,7.6750676050803861,7.5312951004031694,8.0487023087959599,7.3202393694384904]
["KSD-WABL1",-38.859098588673689,-64.131182199043593,-65.512642152145943,-90.72702562122123,-108.65829135631976,-128.6144767920367,-101.02581308609108,-107.72627080830837,-150.53941885271752,-178.52168150084589,-166.0442413267659,-145.72080979617692,-126.10510583272234,-106.7714485574519,-87.13075918755554,-89.27280153379607,-50.637416432578334,-13.812461417388811,4.5771305449505943,11.216118782896567,13.187946744915649]
[null,21.29140934894448,20.996134828204688,27.753422199942179,39.645861057463122,45.868163470833217,49.276482924636248,49.955599968011711,56.345436909729827,67.203792687937266,72.052919983826399,74.977675906263755,69.213283740295452,63.317661722466667,55.34289739592861,48.410127910605205,46.320338268609881,31.678997739387302,15.059662762572149,5.6141360286407789,0.78870191074725915,0.10615319680278922]
[null,10.069799874426952,17.99183216549935,20.046279223089233,27.565931056724011,29.529989919634861,36.431952782825498,24.513402431324405,24.094945233856308,36.840246214056307,43.535475073606023,37.218591056118989,31.881275882038306,26.551703173994746,21.793321457175686,17.503581588084412,19.584033085912694,10.570843259804727,3.1842818364354666,0.63324638334776573,0.319717240684255,0.39502390659509623]
[null,-3.125101087661907,2.0834989961505568,-9.2791227285241931,-10.498673795128903,3.6592521393253641,-1.7183457142206107,2.4464110381116972,1.5075271579699527,-0.72209157742157792,5.2353904372196149,3.1540181475099356,0.16244494632804743,0.30616607628098785,1.7437221973685995,1.7802867405699223,1.5573564160313489,1.9127891895113935,1.2994671197464802,1.5917944655806641E-2,0.14651498739299151,-5.3595321915161684E-2]
["KSD-WABL2",-37.48038683742697,-76.578688191409753,-73.624913293500782,-70.323407863330644,-78.901939056333291,-49.000770660947346,-57.271603882898233,-62.751874841666186,-75.671766960083232,-88.587040739834578,-95.553196700764232,-99.211990351143399,-81.132993774185579,-74.468776534429168,-49.193796347338136,-35.457181648953934,-14.79280525508371,2.8581951768235823,11.453818609245753,13.380198869747097,14.087804353089451]
[null,26.732823275754562,32.130657774190936,38.338065634769102,45.108817913589078,49.880031335430949,50.985358598364201,55.625311664076278,62.340374862059932,72.833041299598165,82.744939919114458,79.448114851798252,72.886408601780786,61.665901259434897,52.974066128805319,41.98298856871547,30.966138411306467,15.840289374184595,5.0893196250878914,1.0513323429464048,0.18049140186113638,0.13439609492115343]
[null,6.5233577439083632,20.385860411379443,14.148844515776791,15.721331410144682,19.29387191795465,4.7080263303857883,3.0693083291732277,7.085170727015301,7.2021517120015366,6.9023275571417209,12.461660698167616,15.188164611070141,12.877237858859377,13.214778747750143,6.9527484493534768,5.656048067794611,3.8087000639563993,1.4034076841248684,-8.0647000528631732E-2,-0.14814628694073895,0.38761782880725959]
[null,2.8838691617807806,-7.6097123449887958,8.8868652716796728,-7.0356113764436961,-9.0519897649781367,16.750068151424934,31.659580843085919,3.3139452239196925,9.1075562500518501,15.962547610472544,-1.5721872743151737,-2.7758235985486168,-6.825896867785004,-6.6348337729686646,0.99635972575952048,1.9697446413408493,-7.6534383836119962E-2,-1.4229686871613987,-0.46029524469708821,-0.17942593274832302,-1.9187415610791601]
["KSW-1LWZUL1",-66.590706756546723,-79.237842684428287,-159.53443955597257,-110.81540334850757,-101.14748579775161,-84.894389092548266,-109.15609614030502,-106.59936302562551,-84.340899151318069,-94.502748425627871,-84.621060147411214,-78.925845981909731,-81.994404668444432,-87.279810591301668,-92.413542926112925,-81.885385817735397,-71.705617077637228,-50.863424758134805,-28.322979124533436,-12.188916742038808,-9.0836033050182436]
[null,31.580346184727517,43.222196781708774,47.242842988937333,51.97150897887267,57.403530317544551,61.302120683017755,61.694308773669,61.511936025811067,64.256529025712766,68.159445647060451,75.340632827759151,81.538519518679848,83.098321117236708,80.635027421570967,77.341352045799596,70.815196229286471,53.945385360552933,35.583207250451338,16.241696399690952,2.5410172518588463,0.65417197434898489]
[null,13.599749605562231,12.287818016443918,40.641914265426713,26.155931192905239,20.340780823709999,12.620107605821392,18.797000532112179,20.943874864024281,13.923239295013627,16.097823630888058,8.7361649861900172,3.3861187180406112,3.215662642957581,5.3894331786568435,8.0000795227017356,5.4237123635203606,8.2433049137736081,8.2235699635310624,8.8684805891466247,9.3060471430338971,9.5944243717789757]
[null,1.3503703341877076,8.6492033495633276,2.5119084724585212,-3.1218600706613815,0.80464391061894325,2.408334441175894,5.7735999530316553,-2.819735998593222,-5.3511950619962958,-7.1647895745417323,-4.105038229438609,-3.2090002904362804,-3.2964423384497481,-3.6639193311287515,-2.2305031765215797,2.6156178626280284,1.8982219237168616,1.4902574498688235,-0.77626330334489035,-2.6652629181619121,-3.4267408265336328]
["KSW-1LWZUL2",540.51643855858993,625.76047264828878,-711.91191790173923,-1080.7769863986446,-1250.8387123952959,-1010.7169164426369,-4.7475581514524006,-291.25438060192135,-732.25096493365288,-1074.9872529347006,-1526.1603195133041,-1785.8675573312466,-1777.1465518467023,-1495.1342519514299,-523.87265012976025,-103.82085515682063,780.55903621748371,868.87502232253814,910.19322512701694,1151.2202437416936,1129.7131394998003]
[null,36.157918471714822,44.347762653759666,52.908111298492187,52.553372771057298,53.933868104418906,55.360488169289546,57.130284076236826,61.059107361723221,66.569380552738039,69.820288736369989,76.166746899614267,80.256578046326609,79.948227257631785,76.492279451075888,71.940819016580491,57.21189598473962,42.165212620650891,26.809055234826904,12.850906893593672,3.4006662662911982,0.71028899620700514]
[null,-180.78663465081058,-214.60365244277239,220.98313213901559,342.61857837578162,397.39949943270796,319.7892508627279,-11.296816973609475,80.840307849261308,224.73225572764031,336.55247319500035,481.92340033171456,564.8629348639065,561.43135507423642,469.43527110709351,153.28357778088048,20.598637335402653,-264.2019898754499,-288.20743064431872,-296.90720559525965,-372.75056951098162,-364.63614612335999]
[null,59.598744653273819,89.393881293217859,-74.904546685433374,-116.11744652987427,-131.63284855941887,-108.48106272927672,16.756729335255926,-16.323314579427958,-72.818607061123274,-118.0505892936856,-173.18232649070239,-203.38708641547146,-201.87913800248569,-166.91762365190334,-50.271416267268776,-2.9284652293783942,102.47861307616139,111.14088983540744,113.74899238620084,142.19017894069344,139.69664962449178]
["KSW-1LWABL1",-174.12020172098053,-257.31649947122543,-86.673698903471902,-77.132219896178256,-143.80903281298802,-114.93000509808476,-125.12351835362711,-122.92621665093276,-125.25958437528179,-158.0324819498168,-166.87898233541432,-156.29301448887688,-145.22557678714401,-133.41480568120781,-134.59265549509263,-93.78273986537198,-95.852651921677051,-56.175535838674769,-21.317895394599134,-1.124556822222478,-2.0451917971411828]
[null,22.571713640691662,37.986024799077406,41.136230886948162,41.678724763837124,55.44651031769056,53.081852568028161,57.951130409369213,60.514594671487082,67.692120261458868,74.580752536011232,84.261620516704625,88.680617897774425,83.301816663070412,75.989596543065602,72.307702514915675,67.748460955881313,52.326665363058929,26.764014367566098,7.9169635071910092,1.1888330387638377,0.3086426287935507]
[null,56.896681387390181,82.954898266948263,19.506693471790868,15.80319436821858,34.414648005712259,24.711063602962767,26.82330228772193,25.557328070571902,22.933696942696667,32.433920431071897,30.038923253516206,23.42256958576537,21.612160550123711,20.049032291675932,20.969818975265376,7.6290180850701121,15.69036161111284,13.407699181035111,10.185007576856053,6.2483380980485457,7.4501642830880481]
[null,-8.8383720081933319,-19.146038825550779,-1.3357521891596253,9.1405215851075834,7.4726087351124395,8.5990855202368746,4.3937593701818587,3.7898713831289745,8.3115793227647341,4.2307706682018615,7.4381562555741283,9.5068872131266584,8.02075936394459,7.4778559610532573,9.8983949466586765,15.143299298474707,8.6924596474897982,2.3961010800838172,-1.8428891814208999,-2.3510870514227169,-2.7467607184523679]
["KSW-1LWABL2",-160.70094744738748,-169.25606616803705,-36.959353880526805,0.99216982801069786,-197.30061936462943,-58.373638099732098,-183.55347024359327,-60.215556841572841,-84.284838285739667,-109.08081746874049,-110.25690628361957,-125.79730239591427,-131.21836999035409,-95.040404552350992,-103.26019186753985,-81.946171193713724,-82.9217107518445,-50.343602857573124,-28.797549626655172,-39.53797640756185,-27.928975567393909]
[null,32.522449764630437,46.910221202872833,52.398484179674639,57.336147300264088,57.715315321468459,62.750104669987991,61.465866922426265,66.746552120911531,75.056063548013583,82.475708549195105,88.758208404458657,88.177657440617125,81.878268486483805,70.608419999991526,62.261037193685297,52.93528504703896,35.475251413478773,13.519487262492001,2.7443884644103447,0.46570598724972467,0.19215340713015458]
[null,50.376394008781745,37.298205348598231,-9.5595098072423266,-39.560726823347601,47.102011740780362,-9.862770293939386,46.491478148381823,-8.1606604760750976,-4.4152361620424765,4.9526728785892589,3.0453443550553159,8.0337963075499292,12.40858239879682,0.80064626804599537,12.03513377080713,10.171687313551782,19.137112326100553,17.267881363053522,13.618123197727888,20.199279200760639,15.869585354281236]
[null,-23.718562531434792,26.855868093240641,49.802401983239783,132.01190101243751,15.007743706310199,76.575793408048995,-9.0585344394808391,61.340411224495412,67.942856982097794,49.105774079437857,47.018565147524733,43.890149214216059,37.61870222193879,54.002235416750594,26.332671307694223,18.527979787969592,2.1717655782399419,-4.6843921274060634,-1.5988601877452087,-12.380137824170198,-6.6225275825345511]
[null,2,3,4,5,6,7,8,9,10,11,12,13,14,15,16,17,18,19,20,21,22]
[]
[null,"Terzfrequenzband fm [Hz]"]
[null,100,125,160,200,250,315,400,500,630,800,1000,1250,1600,2000,2500,3150,4000,5000,6300,8000,10000]
[{"$f":"Grunddaten!C4","v":"KSWZUL5001"},{"$f":"B$4+Lw!B$5*LOG(Grunddaten!$G4)+B$6*LOG(Grunddaten!$F4)+B$7*LOG(Grunddaten!$H4)","v":12.49979071810759},{"$f":"C$4+C$5*LOG(Grunddaten!$G4)+C$6*LOG(Grunddaten!$F4)+C$7*LOG(Grunddaten!$H4)","v":14.169229060673525},{"$f":"D$4+D$5*LOG(Grunddaten!$G4)+D$6*LOG(Grunddaten!$F4)+D$7*LOG(Grunddaten!$H4)","v":16.936628136725862},{"$f":"E$4+E$5*LOG(Grunddaten!$G4)+E$6*LOG(Grunddaten!$F4)+E$7*LOG(Grunddaten!$H4)","v":24.087250883722596},{"$f":"F$4+F$5*LOG(Grunddaten!$G4)+F$6*LOG(Grunddaten!$F4)+F$7*LOG(Grunddaten!$H4)","v":27.33461016854131},{"$f":"G$4+G$5*LOG(Grunddaten!$G4)+G$6*LOG(Grunddaten!$F4)+G$7*LOG(Grunddaten!$H4)","v":26.347545990286516},{"$f":"H$4+H$5*LOG(Grunddaten!$G4)+H$6*LOG(Grunddaten!$F4)+H$7*LOG(Grunddaten!$H4)","v":24.516291626299186},{"$f":"I$4+I$5*LOG(Grunddaten!$G4)+I$6*LOG(Grunddaten!$F4)+I$7*LOG(Grunddaten!$H4)","v":24.844479268294982},{"$f":"J$4+J$5*LOG(Grunddaten!$G4)+J$6*LOG(Grunddaten!$F4)+J$7*LOG(Grunddaten!$H4)","v":28.803994590174462},{"$f":"K$4+K$5*LOG(Grunddaten!$G4)+K$6*LOG(Grunddaten!$F4)+K$7*LOG(Grunddaten!$H4)","v":28.071079162220165},{"$f":"L$4+L$5*LOG(Grunddaten!$G4)+L$6*LOG(Grunddaten!$F4)+L$7*LOG(Grunddaten!$H4)","v":26.978047383817255},{"$f":"M$4+M$5*LOG(Grunddaten!$G4)+M$6*LOG(Grunddaten!$F4)+M$7*LOG(Grunddaten!$H4)","v":22.803323280933817},{"$f":"N$4+N$5*LOG(Grunddaten!$G4)+N$6*LOG(Grunddaten!$F4)+N$7*LOG(Grunddaten!$H4)","v":20.228279581825909},{"$f":"O$4+O$5*LOG(Grunddaten!$G4)+O$6*LOG(Grunddaten!$F4)+O$7*LOG(Grunddaten!$H4)","v":18.088411090596537},{"$f":"P$4+P$5*LOG(Grunddaten!$G4)+P$6*LOG(Grunddaten!$F4)+P$7*LOG(Grunddaten!$H4)","v":18.259851096610525},{"$f":"Q$4+Q$5*LOG(Grunddaten!$G4)+Q$6*LOG(Grunddaten!$F4)+Q$7*LOG(Grunddaten!$H4)","v":16.281265659514652},{"$f":"R$4+R$5*LOG(Grunddaten!$G4)+R$6*LOG(Grunddaten!$F4)+R$7*LOG(Grunddaten!$H4)","v":14.022346783515601},{"$f":"S$4+S$5*LOG(Grunddaten!$G4)+S$6*LOG(Grunddaten!$F4)+S$7*LOG(Grunddaten!$H4)","v":12.600564317413234},{"$f":"T$4+T$5*LOG(Grunddaten!$G4)+T$6*LOG(Grunddaten!$F4)+T$7*LOG(Grunddaten!$H4)","v":12.80164302448846},{"$f":"U$4+U$5*LOG(Grunddaten!$G4)+U$6*LOG(Grunddaten!$F4)+U$7*LOG(Grunddaten!$H4)","v":13.43613963154281},{"$f":"V$4+V$5*LOG(Grunddaten!$G4)+V$6*LOG(Grunddaten!$F4)+V$7*LOG(Grunddaten!$H4)","v":14.652309753261692},{"$f":"10*LOG(10^(0.1*B40)+10^(0.1*C40)+10^(0.1*D40)+10^(0.1*E40)+10^(0.1*F40)+10^(0.1*G40)+10^(0.1*H40)+10^(0.1*I40)+10^(0.1*J40)+10^(0.1*K40)+10^(0.1*L40)+10^(0.1*M40)+10^(0.1*N40)+10^(0.1*O40)+10^(0.1*P40)+10^(0.1*Q40)+10^(0.1*R40)+10^(0.1*S40)+10^(0.1*T40)+10^(0.1*U40)+10^(0.1*V40))","v":36.427800492217386}]
[{"$f":"Grunddaten!C5","v":"KSWZUL8001"},{"$f":"B$4+B$5*LOG(Grunddaten!$G5)+B$6*LOG(Grunddaten!$F5)+B$7*LOG(Grunddaten!$H5)","v":10.75006518072809},{"$f":"C$4+C$5*LOG(Grunddaten!$G5)+C$6*LOG(Grunddaten!$F5)+C$7*LOG(Grunddaten!$H5)","v":11.5069023731228},{"$f":"D$4+D$5*LOG(Grunddaten!$G5)+D$6*LOG(Grunddaten!$F5)+D$7*LOG(Grunddaten!$H5)","v":16.7049111500531},{"$f":"E$4+E$5*LOG(Grunddaten!$G5)+E$6*LOG(Grunddaten!$F5)+E$7*LOG(Grunddaten!$H5)","v":25.245960496559132},{"$f":"F$4+F$5*LOG(Grunddaten!$G5)+F$6*LOG(Grunddaten!$F5)+F$7*LOG(Grunddaten!$H5)","v":30.258930558391363},{"$f":"G$4+G$5*LOG(Grunddaten!$G5)+G$6*LOG(Grunddaten!$F5)+G$7*LOG(Grunddaten!$H5)","v":29.173348341792043},{"$f":"H$4+H$5*LOG(Grunddaten!$G5)+H$6*LOG(Grunddaten!$F5)+H$7*LOG(Grunddaten!$H5)","v":27.371608784766671},{"$f":"I$4+I$5*LOG(Grunddaten!$G5)+I$6*LOG(Grunddaten!$F5)+I$7*LOG(Grunddaten!$H5)","v":28.000238731075406},{"$f":"J$4+J$5*LOG(Grunddaten!$G5)+J$6*LOG(Grunddaten!$F5)+J$7*LOG(Grunddaten!$H5)","v":32.366374456503323},{"$f":"K$4+K$5*LOG(Grunddaten!$G5)+K$6*LOG(Grunddaten!$F5)+K$7*LOG(Grunddaten!$H5)","v":32.643334417635828},{"$f":"L$4+L$5*LOG(Grunddaten!$G5)+L$6*LOG(Grunddaten!$F5)+L$7*LOG(Grunddaten!$H5)","v":30.824332996468282},{"$f":"M$4+M$5*LOG(Grunddaten!$G5)+M$6*LOG(Grunddaten!$F5)+M$7*LOG(Grunddaten!$H5)","v":26.720755114455841},{"$f":"N$4+N$5*LOG(Grunddaten!$G5)+N$6*LOG(Grunddaten!$F5)+N$7*LOG(Grunddaten!$H5)","v":23.883007588433742},{"$f":"O$4+O$5*LOG(Grunddaten!$G5)+O$6*LOG(Grunddaten!$F5)+O$7*LOG(Grunddaten!$H5)","v":21.551601527491375},{"$f":"P$4+P$5*LOG(Grunddaten!$G5)+P$6*LOG(Grunddaten!$F5)+P$7*LOG(Grunddaten!$H5)","v":20.790832091406696},{"$f":"Q$4+Q$5*LOG(Grunddaten!$G5)+Q$6*LOG(Grunddaten!$F5)+Q$7*LOG(Grunddaten!$H5)","v":18.452324903564868},{"$f":"R$4+R$5*LOG(Grunddaten!$G5)+R$6*LOG(Grunddaten!$F5)+R$7*LOG(Grunddaten!$H5)","v":15.479221888420463},{"$f":"S$4+S$5*LOG(Grunddaten!$G5)+S$6*LOG(Grunddaten!$F5)+S$7*LOG(Grunddaten!$H5)","v":13.52171305384126},{"$f":"T$4+T$5*LOG(Grunddaten!$G5)+T$6*LOG(Grunddaten!$F5)+T$7*LOG(Grunddaten!$H5)","v":13.164951925854572},{"$f":"U$4+U$5*LOG(Grunddaten!$G5)+U$6*LOG(Grunddaten!$F5)+U$7*LOG(Grunddaten!$H5)","v":13.396319417008703},{"$f":"V$4+V$5*LOG(Grunddaten!$G5)+V$6*LOG(Grunddaten!$F5)+V$7*LOG(Grunddaten!$H5)","v":14.586642430357337},{"$f":"10*LOG(10^(0.1*B41)+10^(0.1*C41)+10^(0.1*D41)+10^(0.1*E41)+10^(0.1*F41)+10^(0.1*G41)+10^(0.1*H41)+10^(0.1*I41)+10^(0.1*J41)+10^(0.1*K41)+10^(0.1*L41)+10^(0.1*M41)+10^(0.1*N41)+10^(0.1*O41)+10^(0.1*P41)+10^(0.1*Q41)+10^(0.1*R41)+10^(0.1*S41)+10^(0.1*T41)+10^(0.1*U41)+10^(0.1*V41))","v":39.740745565361678}]
[{"$f":"Grunddaten!C6","v":"KSWZUL10001"},{"$f":"B$4+B$5*LOG(Grunddaten!$G6)+B$6*LOG(Grunddaten!$F6)+B$7*LOG(Grunddaten!$H6)","v":11.719630690737418},{"$f":"C$4+C$5*LOG(Grunddaten!$G6)+C$6*LOG(Grunddaten!$F6)+C$7*LOG(Grunddaten!$H6)","v":11.138890093823028},{"$f":"D$4+D$5*LOG(Grunddaten!$G6)+D$6*LOG(Grunddaten!$F6)+D$7*LOG(Grunddaten!$H6)","v":14.054736804692652},{"$f":"E$4+E$5*LOG(Grunddaten!$G6)+E$6*LOG(Grunddaten!$F6)+E$7*LOG(Grunddaten!$H6)","v":20.998633585735583},{"$f":"F$4+F$5*LOG(Grunddaten!$G6)+F$6*LOG(Grunddaten!$F6)+F$7*LOG(Grunddaten!$H6)","v":25.504856935014306},{"$f":"G$4+G$5*LOG(Grunddaten!$G6)+G$6*LOG(Grunddaten!$F6)+G$7*LOG(Grunddaten!$H6)","v":24.929795775682638},{"$f":"H$4+H$5*LOG(Grunddaten!$G6)+H$6*LOG(Grunddaten!$F6)+H$7*LOG(Grunddaten!$H6)","v":23.278730605877513},{"$f":"I$4+I$5*LOG(Grunddaten!$G6)+I$6*LOG(Grunddaten!$F6)+I$7*LOG(Grunddaten!$H6)","v":22.188933790669779},{"$f":"J$4+J$5*LOG(Grunddaten!$G6)+J$6*LOG(Grunddaten!$F6)+J$7*LOG(Grunddaten!$H6)","v":25.717868675130497},{"$f":"K$4+K$5*LOG(Grunddaten!$G6)+K$6*LOG(Grunddaten!$F6)+K$7*LOG(Grunddaten!$H6)","v":25.909263597532355},{"$f":"L$4+L$5*LOG(Grunddaten!$G6)+L$6*LOG(Grunddaten!$F6)+L$7*LOG(Grunddaten!$H6)","v":23.183287927851833},{"$f":"M$4+M$5*LOG(Grunddaten!$G6)+M$6*LOG(Grunddaten!$F6)+M$7*LOG(Grunddaten!$H6)","v":19.538487522022422},{"$f":"N$4+N$5*LOG(Grunddaten!$G6)+N$6*LOG(Grunddaten!$F6)+N$7*LOG(Grunddaten!$H6)","v":16.854755756844142},{"$f":"O$4+O$5*LOG(Grunddaten!$G6)+O$6*LOG(Grunddaten!$F6)+O$7*LOG(Grunddaten!$H6)","v":15.434144814451916},{"$f":"P$4+P$5*LOG(Grunddaten!$G6)+P$6*LOG(Grunddaten!$F6)+P$7*LOG(Grunddaten!$H6)","v":15.568243476771633},{"$f":"Q$4+Q$5*LOG(Grunddaten!$G6)+Q$6*LOG(Grunddaten!$F6)+Q$7*LOG(Grunddaten!$H6)","v":14.335563864546002},{"$f":"R$4+R$5*LOG(Grunddaten!$G6)+R$6*LOG(Grunddaten!$F6)+R$7*LOG(Grunddaten!$H6)","v":13.148198173579164},{"$f":"S$4+S$5*LOG(Grunddaten!$G6)+S$6*LOG(Grunddaten!$F6)+S$7*LOG(Grunddaten!$H6)","v":12.151271787410222},{"$f":"T$4+T$5*LOG(Grunddaten!$G6)+T$6*LOG(Grunddaten!$F6)+T$7*LOG(Grunddaten!$H6)","v":12.518489585453189},{"$f":"U$4+U$5*LOG(Grunddaten!$G6)+U$6*LOG(Grunddaten!$F6)+U$7*LOG(Grunddaten!$H6)","v":13.153729894953175},{"$f":"V$4+V$5*LOG(Grunddaten!$G6)+V$6*LOG(Grunddaten!$F6)+V$7*LOG(Grunddaten!$H6)","v":14.436279748031565},{"$f":"10*LOG(10^(0.1*B42)+10^(0.1*C42)+10^(0.1*D42)+10^(0.1*E42)+10^(0.1*F42)+10^(0.1*G42)+10^(0.1*H42)+10^(0.1*I42)+10^(0.1*J42)+10^(0.1*K42)+10^(0.1*L42)+10^(0.1*M42)+10^(0.1*N42)+10^(0.1*O42)+10^(0.1*P42)+10^(0.1*Q42)+10^(0.1*R42)+10^(0.1*S42)+10^(0.1*T42)+10^(0.1*U42)+10^(0.1*V42))","v":34.039347775076777}]
[{"$f":"Grunddaten!C7","v":"KSWZUL12001"},{"$f":"B$4+B$5*LOG(Grunddaten!$G7)+B$6*LOG(Grunddaten!$F7)+B$7*LOG(Grunddaten!$H7)","v":13.148723623046186},{"$f":"C$4+C$5*LOG(Grunddaten!$G7)+C$6*LOG(Grunddaten!$F7)+C$7*LOG(Grunddaten!$H7)","v":13.312083824562434},{"$f":"D$4+D$5*LOG(Grunddaten!$G7)+D$6*LOG(Grunddaten!$F7)+D$7*LOG(Grunddaten!$H7)","v":14.242079972429346},{"$f":"E$4+E$5*LOG(Grunddaten!$G7)+E$6*LOG(Grunddaten!$F7)+E$7*LOG(Grunddaten!$H7)","v":20.049773227284774},{"$f":"F$4+F$5*LOG(Grunddaten!$G7)+F$6*LOG(Grunddaten!$F7)+F$7*LOG(Grunddaten!$H7)","v":23.114253915526511},{"$f":"G$4+G$5*LOG(Grunddaten!$G7)+G$6*LOG(Grunddaten!$F7)+G$7*LOG(Grunddaten!$H7)","v":22.619971406263076},{"$f":"H$4+H$5*LOG(Grunddaten!$G7)+H$6*LOG(Grunddaten!$F7)+H$7*LOG(Grunddaten!$H7)","v":20.944914894352017},{"$f":"I$4+I$5*LOG(Grunddaten!$G7)+I$6*LOG(Grunddaten!$F7)+I$7*LOG(Grunddaten!$H7)","v":19.608662947080099},{"$f":"J$4+J$5*LOG(Grunddaten!$G7)+J$6*LOG(Grunddaten!$F7)+J$7*LOG(Grunddaten!$H7)","v":22.805068433834133},{"$f":"K$4+K$5*LOG(Grunddaten!$G7)+K$6*LOG(Grunddaten!$F7)+K$7*LOG(Grunddaten!$H7)","v":22.17197121878872},{"$f":"L$4+L$5*LOG(Grunddaten!$G7)+L$6*LOG(Grunddaten!$F7)+L$7*LOG(Grunddaten!$H7)","v":20.038032100716343},{"$f":"M$4+M$5*LOG(Grunddaten!$G7)+M$6*LOG(Grunddaten!$F7)+M$7*LOG(Grunddaten!$H7)","v":16.335465707633137},{"$f":"N$4+N$5*LOG(Grunddaten!$G7)+N$6*LOG(Grunddaten!$F7)+N$7*LOG(Grunddaten!$H7)","v":13.866303795878347},{"$f":"O$4+O$5*LOG(Grunddaten!$G7)+O$6*LOG(Grunddaten!$F7)+O$7*LOG(Grunddaten!$H7)","v":12.602685455551214},{"$f":"P$4+P$5*LOG(Grunddaten!$G7)+P$6*LOG(Grunddaten!$F7)+P$7*LOG(Grunddaten!$H7)","v":13.498428992220511},{"$f":"Q$4+Q$5*LOG(Grunddaten!$G7)+Q$6*LOG(Grunddaten!$F7)+Q$7*LOG(Grunddaten!$H7)","v":12.560340215628234},{"$f":"R$4+R$5*LOG(Grunddaten!$G7)+R$6*LOG(Grunddaten!$F7)+R$7*LOG(Grunddaten!$H7)","v":11.957242926924277},{"$f":"S$4+S$5*LOG(Grunddaten!$G7)+S$6*LOG(Grunddaten!$F7)+S$7*LOG(Grunddaten!$H7)","v":11.398329252988473},{"$f":"T$4+T$5*LOG(Grunddaten!$G7)+T$6*LOG(Grunddaten!$F7)+T$7*LOG(Grunddaten!$H7)","v":12.221449724999461},{"$f":"U$4+U$5*LOG(Grunddaten!$G7)+U$6*LOG(Grunddaten!$F7)+U$7*LOG(Grunddaten!$H7)","v":13.186071017189608},{"$f":"V$4+V$5*LOG(Grunddaten!$G7)+V$6*LOG(Grunddaten!$F7)+V$7*LOG(Grunddaten!$H7)","v":14.489785179847884},{"$f":"10*LOG(10^(0.1*B43)+10^(0.1*C43)+10^(0.1*D43)+10^(0.1*E43)+10^(0.1*F43)+10^(0.1*G43)+10^(0.1*H43)+10^(0.1*I43)+10^(0.1*J43)+10^(0.1*K43)+10^(0.1*L43)+10^(0.1*M43)+10^(0.1*N43)+10^(0.1*O43)+10^(0.1*P43)+10^(0.1*Q43)+10^(0.1*R43)+10^(0.1*S43)+10^(0.1*T43)+10^(0.1*U43)+10^(0.1*V43))","v":31.616010793891498}]
[{"$f":"Grunddaten!C8","v":"KSWZUL5002"},{"$f":"B$8+B$9*LOG(Grunddaten!$G8)+B$10*LOG(Grunddaten!$F8)+B$11*LOG(Grunddaten!$H8)","v":12.158627164939839},{"$f":"C$8+C$9*LOG(Grunddaten!$G8)+C$10*LOG(Grunddaten!$F8)+C$11*LOG(Grunddaten!$H8)","v":10.387922838187317},{"$f":"D$8+D$9*LOG(Grunddaten!$G8)+D$10*LOG(Grunddaten!$F8)+D$11*LOG(Grunddaten!$H8)","v":10.158050675527381},{"$f":"E$8+E$9*LOG(Grunddaten!$G8)+E$10*LOG(Grunddaten!$F8)+E$11*LOG(Grunddaten!$H8)","v":13.076631159209732},{"$f":"F$8+F$9*LOG(Grunddaten!$G8)+F$10*LOG(Grunddaten!$F8)+F$11*LOG(Grunddaten!$H8)","v":18.427068671827392},{"$f":"G$8+G$9*LOG(Grunddaten!$G8)+G$10*LOG(Grunddaten!$F8)+G$11*LOG(Grunddaten!$H8)","v":18.769631220761099},{"$f":"H$8+H$9*LOG(Grunddaten!$G8)+H$10*LOG(Grunddaten!$F8)+H$11*LOG(Grunddaten!$H8)","v":18.033461352059739},{"$f":"I$8+I$9*LOG(Grunddaten!$G8)+I$10*LOG(Grunddaten!$F8)+I$11*LOG(Grunddaten!$H8)","v":17.202472632966526},{"$f":"J$8+J$9*LOG(Grunddaten!$G8)+J$10*LOG(Grunddaten!$F8)+J$11*LOG(Grunddaten!$H8)","v":17.316129530480172},{"$f":"K$8+K$9*LOG(Grunddaten!$G8)+K$10*LOG(Grunddaten!$F8)+K$11*LOG(Grunddaten!$H8)","v":16.800952868022037},{"$f":"L$8+L$9*LOG(Grunddaten!$G8)+L$10*LOG(Grunddaten!$F8)+L$11*LOG(Grunddaten!$H8)","v":15.134119572792226},{"$f":"M$8+M$9*LOG(Grunddaten!$G8)+M$10*LOG(Grunddaten!$F8)+M$11*LOG(Grunddaten!$H8)","v":12.929266393895752},{"$f":"N$8+N$9*LOG(Grunddaten!$G8)+N$10*LOG(Grunddaten!$F8)+N$11*LOG(Grunddaten!$H8)","v":10.701816809660606},{"$f":"O$8+O$9*LOG(Grunddaten!$G8)+O$10*LOG(Grunddaten!$F8)+O$11*LOG(Grunddaten!$H8)","v":9.6700968833089131},{"$f":"P$8+P$9*LOG(Grunddaten!$G8)+P$10*LOG(Grunddaten!$F8)+P$11*LOG(Grunddaten!$H8)","v":10.605030357434497},{"$f":"Q$8+Q$9*LOG(Grunddaten!$G8)+Q$10*LOG(Grunddaten!$F8)+Q$11*LOG(Grunddaten!$H8)","v":10.721315595398718},{"$f":"R$8+R$9*LOG(Grunddaten!$G8)+R$10*LOG(Grunddaten!$F8)+R$11*LOG(Grunddaten!$H8)","v":11.188323523767759},{"$f":"S$8+S$9*LOG(Grunddaten!$G8)+S$10*LOG(Grunddaten!$F8)+S$11*LOG(Grunddaten!$H8)","v":11.131620558758666},{"$f":"T$8+T$9*LOG(Grunddaten!$G8)+T$10*LOG(Grunddaten!$F8)+T$11*LOG(Grunddaten!$H8)","v":11.945849768761835},{"$f":"U$8+U$9*LOG(Grunddaten!$G8)+U$10*LOG(Grunddaten!$F8)+U$11*LOG(Grunddaten!$H8)","v":12.940249489059052},{"$f":"V$8+V$9*LOG(Grunddaten!$G8)+V$10*LOG(Grunddaten!$F8)+V$11*LOG(Grunddaten!$H8)","v":14.165677310347323},{"$f":"10*LOG(10^(0.1*B44)+10^(0.1*C44)+10^(0.1*D44)+10^(0.1*E44)+10^(0.1*F44)+10^(0.1*G44)+10^(0.1*H44)+10^(0.1*I44)+10^(0.1*J44)+10^(0.1*K44)+10^(0.1*L44)+10^(0.1*M44)+10^(0.1*N44)+10^(0.1*O44)+10^(0.1*P44)+10^(0.1*Q44)+10^(0.1*R44)+10^(0.1*S44)+10^(0.1*T44)+10^(0.1*U44)+10^(0.1*V44))","v":27.817466669437458}]
[{"$f":"Grunddaten!C9","v":"KSWZUL8002"},{"$f":"B$8+B$9*LOG(Grunddaten!$G9)+B$10*LOG(Grunddaten!$F9)+B$11*LOG(Grunddaten!$H9)","v":10.440517196193134},{"$f":"C$8+C$9*LOG(Grunddaten!$G9)+C$10*LOG(Grunddaten!$F9)+C$11*LOG(Grunddaten!$H9)","v":10.232660927061996},{"$f":"D$8+D$9*LOG(Grunddaten!$G9)+D$10*LOG(Grunddaten!$F9)+D$11*LOG(Grunddaten!$H9)","v":9.20205763212204},{"$f":"E$8+E$9*LOG(Grunddaten!$G9)+E$10*LOG(Grunddaten!$F9)+E$11*LOG(Grunddaten!$H9)","v":16.939539842420608},{"$f":"F$8+F$9*LOG(Grunddaten!$G9)+F$10*LOG(Grunddaten!$F9)+F$11*LOG(Grunddaten!$H9)","v":23.52594132573158},{"$f":"G$8+G$9*LOG(Grunddaten!$G9)+G$10*LOG(Grunddaten!$F9)+G$11*LOG(Grunddaten!$H9)","v":25.557801676318427},{"$f":"H$8+H$9*LOG(Grunddaten!$G9)+H$10*LOG(Grunddaten!$F9)+H$11*LOG(Grunddaten!$H9)","v":23.658920433846184},{"$f":"I$8+I$9*LOG(Grunddaten!$G9)+I$10*LOG(Grunddaten!$F9)+I$11*LOG(Grunddaten!$H9)","v":22.175969028729838},{"$f":"J$8+J$9*LOG(Grunddaten!$G9)+J$10*LOG(Grunddaten!$F9)+J$11*LOG(Grunddaten!$H9)","v":21.580661764573122},{"$f":"K$8+K$9*LOG(Grunddaten!$G9)+K$10*LOG(Grunddaten!$F9)+K$11*LOG(Grunddaten!$H9)","v":21.417582334391604},{"$f":"L$8+L$9*LOG(Grunddaten!$G9)+L$10*LOG(Grunddaten!$F9)+L$11*LOG(Grunddaten!$H9)","v":20.212997641846346},{"$f":"M$8+M$9*LOG(Grunddaten!$G9)+M$10*LOG(Grunddaten!$F9)+M$11*LOG(Grunddaten!$H9)","v":18.374887178385329},{"$f":"N$8+N$9*LOG(Grunddaten!$G9)+N$10*LOG(Grunddaten!$F9)+N$11*LOG(Grunddaten!$H9)","v":17.127558816513357},{"$f":"O$8+O$9*LOG(Grunddaten!$G9)+O$10*LOG(Grunddaten!$F9)+O$11*LOG(Grunddaten!$H9)","v":15.459674292636194},{"$f":"P$8+P$9*LOG(Grunddaten!$G9)+P$10*LOG(Grunddaten!$F9)+P$11*LOG(Grunddaten!$H9)","v":14.817998652027372},{"$f":"Q$8+Q$9*LOG(Grunddaten!$G9)+Q$10*LOG(Grunddaten!$F9)+Q$11*LOG(Grunddaten!$H9)","v":13.144422009299083},{"$f":"R$8+R$9*LOG(Grunddaten!$G9)+R$10*LOG(Grunddaten!$F9)+R$11*LOG(Grunddaten!$H9)","v":11.822174050441003},{"$f":"S$8+S$9*LOG(Grunddaten!$G9)+S$10*LOG(Grunddaten!$F9)+S$11*LOG(Grunddaten!$H9)","v":10.473527204697277},{"$f":"T$8+T$9*LOG(Grunddaten!$G9)+T$10*LOG(Grunddaten!$F9)+T$11*LOG(Grunddaten!$H9)","v":10.701576436957643},{"$f":"U$8+U$9*LOG(Grunddaten!$G9)+U$10*LOG(Grunddaten!$F9)+U$11*LOG(Grunddaten!$H9)","v":11.387587573086178},{"$f":"V$8+V$9*LOG(Grunddaten!$G9)+V$10*LOG(Grunddaten!$F9)+V$11*LOG(Grunddaten!$H9)","v":12.676856924523175},32.370002379052302]
[{"$f":"Grunddaten!C10","v":"KSWZUL10002"},{"$f":"B$8+B$9*LOG(Grunddaten!$G10)+B$10*LOG(Grunddaten!$F10)+B$11*LOG(Grunddaten!$H10)","v":11.979470974564922},{"$f":"C$8+C$9*LOG(Grunddaten!$G10)+C$10*LOG(Grunddaten!$F10)+C$11*LOG(Grunddaten!$H10)","v":10.520031182507378},{"$f":"D$8+D$9*LOG(Grunddaten!$G10)+D$10*LOG(Grunddaten!$F10)+D$11*LOG(Grunddaten!$H10)","v":10.128522755551174},{"$f":"E$8+E$9*LOG(Grunddaten!$G10)+E$10*LOG(Grunddaten!$F10)+E$11*LOG(Grunddaten!$H10)","v":13.604487443740208},{"$f":"F$8+F$9*LOG(Grunddaten!$G10)+F$10*LOG(Grunddaten!$F10)+F$11*LOG(Grunddaten!$H10)","v":18.800643672104176},{"$f":"G$8+G$9*LOG(Grunddaten!$G10)+G$10*LOG(Grunddaten!$F10)+G$11*LOG(Grunddaten!$H10)","v":19.308312150834503},{"$f":"H$8+H$9*LOG(Grunddaten!$G10)+H$10*LOG(Grunddaten!$F10)+H$11*LOG(Grunddaten!$H10)","v":18.448160647737989},{"$f":"I$8+I$9*LOG(Grunddaten!$G10)+I$10*LOG(Grunddaten!$F10)+I$11*LOG(Grunddaten!$H10)","v":17.413813730101655},{"$f":"J$8+J$9*LOG(Grunddaten!$G10)+J$10*LOG(Grunddaten!$F10)+J$11*LOG(Grunddaten!$H10)","v":17.487638567542199},{"$f":"K$8+K$9*LOG(Grunddaten!$G10)+K$10*LOG(Grunddaten!$F10)+K$11*LOG(Grunddaten!$H10)","v":16.980423932152942},{"$f":"L$8+L$9*LOG(Grunddaten!$G10)+L$10*LOG(Grunddaten!$F10)+L$11*LOG(Grunddaten!$H10)","v":15.284093025941711},{"$f":"M$8+M$9*LOG(Grunddaten!$G10)+M$10*LOG(Grunddaten!$F10)+M$11*LOG(Grunddaten!$H10)","v":13.143127702372215},{"$f":"N$8+N$9*LOG(Grunddaten!$G10)+N$10*LOG(Grunddaten!$F10)+N$11*LOG(Grunddaten!$H10)","v":11.077529493424425},{"$f":"O$8+O$9*LOG(Grunddaten!$G10)+O$10*LOG(Grunddaten!$F10)+O$11*LOG(Grunddaten!$H10)","v":10.029945989508469},{"$f":"P$8+P$9*LOG(Grunddaten!$G10)+P$10*LOG(Grunddaten!$F10)+P$11*LOG(Grunddaten!$H10)","v":10.816825756812346},{"$f":"Q$8+Q$9*LOG(Grunddaten!$G10)+Q$10*LOG(Grunddaten!$F10)+Q$11*LOG(Grunddaten!$H10)","v":10.806280483858965},{"$f":"R$8+R$9*LOG(Grunddaten!$G10)+R$10*LOG(Grunddaten!$F10)+R$11*LOG(Grunddaten!$H10)","v":11.119288265417229},{"$f":"S$8+S$9*LOG(Grunddaten!$G10)+S$10*LOG(Grunddaten!$F10)+S$11*LOG(Grunddaten!$H10)","v":11.007922886251146},{"$f":"T$8+T$9*LOG(Grunddaten!$G10)+T$10*LOG(Grunddaten!$F10)+T$11*LOG(Grunddaten!$H10)","v":11.824469251635119},{"$f":"U$8+U$9*LOG(Grunddaten!$G10)+U$10*LOG(Grunddaten!$F10)+U$11*LOG(Grunddaten!$H10)","v":12.810530013800626},{"$f":"V$8+V$9*LOG(Grunddaten!$G10)+V$10*LOG(Grunddaten!$F10)+V$11*LOG(Grunddaten!$H10)","v":14.047698340155833},28.055842762667996]
[{"$f":"Grunddaten!C11","v":"KSWZUL12002"},{"$f":"B$8+B$9*LOG(Grunddaten!$G11)+B$10*LOG(Grunddaten!$F11)+B$11*LOG(Grunddaten!$H11)","v":11.804651698477132},{"$f":"C$8+C$9*LOG(Grunddaten!$G11)+C$10*LOG(Grunddaten!$F11)+C$11*LOG(Grunddaten!$H11)","v":11.810949219436566},{"$f":"D$8+D$9*LOG(Grunddaten!$G11)+D$10*LOG(Grunddaten!$F11)+D$11*LOG(Grunddaten!$H11)","v":10.649443553355237},{"$f":"E$8+E$9*LOG(Grunddaten!$G11)+E$10*LOG(Grunddaten!$F11)+E$11*LOG(Grunddaten!$H11)","v":15.099415513294179},{"$f":"F$8+F$9*LOG(Grunddaten!$G11)+F$10*LOG(Grunddaten!$F11)+F$11*LOG(Grunddaten!$H11)","v":17.926281126124028},{"$f":"G$8+G$9*LOG(Grunddaten!$G11)+G$10*LOG(Grunddaten!$F11)+G$11*LOG(Grunddaten!$H11)","v":18.508507631912423},{"$f":"H$8+H$9*LOG(Grunddaten!$G11)+H$10*LOG(Grunddaten!$F11)+H$11*LOG(Grunddaten!$H11)","v":17.505908388764137},{"$f":"I$8+I$9*LOG(Grunddaten!$G11)+I$10*LOG(Grunddaten!$F11)+I$11*LOG(Grunddaten!$H11)","v":15.212382797745944},{"$f":"J$8+J$9*LOG(Grunddaten!$G11)+J$10*LOG(Grunddaten!$F11)+J$11*LOG(Grunddaten!$H11)","v":15.514497212624391},{"$f":"K$8+K$9*LOG(Grunddaten!$G11)+K$10*LOG(Grunddaten!$F11)+K$11*LOG(Grunddaten!$H11)","v":14.789754817934966},{"$f":"L$8+L$9*LOG(Grunddaten!$G11)+L$10*LOG(Grunddaten!$F11)+L$11*LOG(Grunddaten!$H11)","v":12.455823974672949},{"$f":"M$8+M$9*LOG(Grunddaten!$G11)+M$10*LOG(Grunddaten!$F11)+M$11*LOG(Grunddaten!$H11)","v":10.578149653517855},{"$f":"N$8+N$9*LOG(Grunddaten!$G11)+N$10*LOG(Grunddaten!$F11)+N$11*LOG(Grunddaten!$H11)","v":9.1378717372927092},{"$f":"O$8+O$9*LOG(Grunddaten!$G11)+O$10*LOG(Grunddaten!$F11)+O$11*LOG(Grunddaten!$H11)","v":8.470292186789262},{"$f":"P$8+P$9*LOG(Grunddaten!$G11)+P$10*LOG(Grunddaten!$F11)+P$11*LOG(Grunddaten!$H11)","v":9.2407945688365452},{"$f":"Q$8+Q$9*LOG(Grunddaten!$G11)+Q$10*LOG(Grunddaten!$F11)+Q$11*LOG(Grunddaten!$H11)","v":9.5751182325324233},{"$f":"R$8+R$9*LOG(Grunddaten!$G11)+R$10*LOG(Grunddaten!$F11)+R$11*LOG(Grunddaten!$H11)","v":9.9930972156208586},{"$f":"S$8+S$9*LOG(Grunddaten!$G11)+S$10*LOG(Grunddaten!$F11)+S$11*LOG(Grunddaten!$H11)","v":10.455674305639949},{"$f":"T$8+T$9*LOG(Grunddaten!$G11)+T$10*LOG(Grunddaten!$F11)+T$11*LOG(Grunddaten!$H11)","v":11.771581975281073},{"$f":"U$8+U$9*LOG(Grunddaten!$G11)+U$10*LOG(Grunddaten!$F11)+U$11*LOG(Grunddaten!$H11)","v":12.936136639529762},{"$f":"V$8+V$9*LOG(Grunddaten!$G11)+V$10*LOG(Grunddaten!$F11)+V$11*LOG(Grunddaten!$H11)","v":14.22459295542088},27.045535188103216]
[{"$f":"Grunddaten!C12","v":"KSWABL5001"},{"$f":"B50","v":11.333556510336106},{"$f":"C50","v":11.458743899551253},14.222304610447384,22.599610695331499,29.344185924597017,27.606890413325466,27.340892104691459,26.417172040823974,29.206691143007205,30.133594719723494,27.336851113178447,23.803232805700571,22.056166311245935,20.151037372772443,19.896649236106743,20.66622398239323,17.643658074366233,14.006081251490972,13.059696576493195,13.151685292354804,14.336943963572482,37.729170629059716]
[{"$f":"Grunddaten!C13","v":"KSWABL8001"},{"$f":"B$12+B$13*LOG(Grunddaten!$G13)+B$14*LOG(Grunddaten!$F13)+B$15*LOG(Grunddaten!$H13)","v":12.86052729335262},{"$f":"C$12+C$13*LOG(Grunddaten!$G13)+C$14*LOG(Grunddaten!$F13)+C$15*LOG(Grunddaten!$H13)","v":11.456887447857254},{"$f":"D$12+D$13*LOG(Grunddaten!$G13)+D$14*LOG(Grunddaten!$F13)+D$15*LOG(Grunddaten!$H13)","v":16.274131410566781},{"$f":"E$12+E$13*LOG(Grunddaten!$G13)+E$14*LOG(Grunddaten!$F13)+E$15*LOG(Grunddaten!$H13)","v":25.246710393474206},{"$f":"F$12+F$13*LOG(Grunddaten!$G13)+F$14*LOG(Grunddaten!$F13)+F$15*LOG(Grunddaten!$H13)","v":30.412916154850045},{"$f":"G$12+G$13*LOG(Grunddaten!$G13)+G$14*LOG(Grunddaten!$F13)+G$15*LOG(Grunddaten!$H13)","v":29.093305777322776},{"$f":"H$12+H$13*LOG(Grunddaten!$G13)+H$14*LOG(Grunddaten!$F13)+H$15*LOG(Grunddaten!$H13)","v":29.462455842813938},{"$f":"I$12+I$13*LOG(Grunddaten!$G13)+I$14*LOG(Grunddaten!$F13)+I$15*LOG(Grunddaten!$H13)","v":29.330563342323885},{"$f":"J$12+J$13*LOG(Grunddaten!$G13)+J$14*LOG(Grunddaten!$F13)+J$15*LOG(Grunddaten!$H13)","v":32.250770911173717},{"$f":"K$12+K$13*LOG(Grunddaten!$G13)+K$14*LOG(Grunddaten!$F13)+K$15*LOG(Grunddaten!$H13)","v":32.160965212010758},{"$f":"L$12+L$13*LOG(Grunddaten!$G13)+L$14*LOG(Grunddaten!$F13)+L$15*LOG(Grunddaten!$H13)","v":30.552533434331004},{"$f":"M$12+M$13*LOG(Grunddaten!$G13)+M$14*LOG(Grunddaten!$F13)+M$15*LOG(Grunddaten!$H13)","v":27.398233462248488},{"$f":"N$12+N$13*LOG(Grunddaten!$G13)+N$14*LOG(Grunddaten!$F13)+N$15*LOG(Grunddaten!$H13)","v":25.576099550472211},{"$f":"O$12+O$13*LOG(Grunddaten!$G13)+O$14*LOG(Grunddaten!$F13)+O$15*LOG(Grunddaten!$H13)","v":23.15710672555937},{"$f":"P$12+P$13*LOG(Grunddaten!$G13)+P$14*LOG(Grunddaten!$F13)+P$15*LOG(Grunddaten!$H13)","v":22.641440465179265},{"$f":"Q$12+Q$13*LOG(Grunddaten!$G13)+Q$14*LOG(Grunddaten!$F13)+Q$15*LOG(Grunddaten!$H13)","v":23.038227886681362},{"$f":"R$12+R$13*LOG(Grunddaten!$G13)+R$14*LOG(Grunddaten!$F13)+R$15*LOG(Grunddaten!$H13)","v":19.420253139618758},{"$f":"S$12+S$13*LOG(Grunddaten!$G13)+S$14*LOG(Grunddaten!$F13)+S$15*LOG(Grunddaten!$H13)","v":14.974179888028642},{"$f":"T$12+T$13*LOG(Grunddaten!$G13)+T$14*LOG(Grunddaten!$F13)+T$15*LOG(Grunddaten!$H13)","v":13.540156108628652},{"$f":"U$12+U$13*LOG(Grunddaten!$G13)+U$14*LOG(Grunddaten!$F13)+U$15*LOG(Grunddaten!$H13)","v":13.176530129973978},{"$f":"V$12+V$13*LOG(Grunddaten!$G13)+V$14*LOG(Grunddaten!$F13)+V$15*LOG(Grunddaten!$H13)","v":14.31648663512175},40.091790108221474]
[{"$f":"Grunddaten!C14","v":"KSWABL10001"},{"$f":"B$12+B$13*LOG(Grunddaten!$G14)+B$14*LOG(Grunddaten!$F14)+B$15*LOG(Grunddaten!$H14)","v":11.333556510336106},{"$f":"C$12+C$13*LOG(Grunddaten!$G14)+C$14*LOG(Grunddaten!$F14)+C$15*LOG(Grunddaten!$H14)","v":11.458743899551253},{"$f":"D$12+D$13*LOG(Grunddaten!$G14)+D$14*LOG(Grunddaten!$F14)+D$15*LOG(Grunddaten!$H14)","v":14.222304610447384},{"$f":"E$12+E$13*LOG(Grunddaten!$G14)+E$14*LOG(Grunddaten!$F14)+E$15*LOG(Grunddaten!$H14)","v":22.599610695331499},{"$f":"F$12+F$13*LOG(Grunddaten!$G14)+F$14*LOG(Grunddaten!$F14)+F$15*LOG(Grunddaten!$H14)","v":29.344185924597017},{"$f":"G$12+G$13*LOG(Grunddaten!$G14)+G$14*LOG(Grunddaten!$F14)+G$15*LOG(Grunddaten!$H14)","v":27.606890413325466},{"$f":"H$12+H$13*LOG(Grunddaten!$G14)+H$14*LOG(Grunddaten!$F14)+H$15*LOG(Grunddaten!$H14)","v":27.340892104691459},{"$f":"I$12+I$13*LOG(Grunddaten!$G14)+I$14*LOG(Grunddaten!$F14)+I$15*LOG(Grunddaten!$H14)","v":26.417172040823974},{"$f":"J$12+J$13*LOG(Grunddaten!$G14)+J$14*LOG(Grunddaten!$F14)+J$15*LOG(Grunddaten!$H14)","v":29.206691143007205},{"$f":"K$12+K$13*LOG(Grunddaten!$G14)+K$14*LOG(Grunddaten!$F14)+K$15*LOG(Grunddaten!$H14)","v":30.133594719723494},{"$f":"L$12+L$13*LOG(Grunddaten!$G14)+L$14*LOG(Grunddaten!$F14)+L$15*LOG(Grunddaten!$H14)","v":27.336851113178447},{"$f":"M$12+M$13*LOG(Grunddaten!$G14)+M$14*LOG(Grunddaten!$F14)+M$15*LOG(Grunddaten!$H14)","v":23.803232805700571},{"$f":"N$12+N$13*LOG(Grunddaten!$G14)+N$14*LOG(Grunddaten!$F14)+N$15*LOG(Grunddaten!$H14)","v":22.056166311245935},{"$f":"O$12+O$13*LOG(Grunddaten!$G14)+O$14*LOG(Grunddaten!$F14)+O$15*LOG(Grunddaten!$H14)","v":20.151037372772443},{"$f":"P$12+P$13*LOG(Grunddaten!$G14)+P$14*LOG(Grunddaten!$F14)+P$15*LOG(Grunddaten!$H14)","v":19.896649236106743},{"$f":"Q$12+Q$13*LOG(Grunddaten!$G14)+Q$14*LOG(Grunddaten!$F14)+Q$15*LOG(Grunddaten!$H14)","v":20.66622398239323},{"$f":"R$12+R$13*LOG(Grunddaten!$G14)+R$14*LOG(Grunddaten!$F14)+R$15*LOG(Grunddaten!$H14)","v":17.643658074366233},{"$f":"S$12+S$13*LOG(Grunddaten!$G14)+S$14*LOG(Grunddaten!$F14)+S$15*LOG(Grunddaten!$H14)","v":14.006081251490972},{"$f":"T$12+T$13*LOG(Grunddaten!$G14)+T$14*LOG(Grunddaten!$F14)+T$15*LOG(Grunddaten!$H14)","v":13.059696576493195},{"$f":"U$12+U$13*LOG(Grunddaten!$G14)+U$14*LOG(Grunddaten!$F14)+U$15*LOG(Grunddaten!$H14)","v":13.151685292354804},{"$f":"V$12+V$13*LOG(Grunddaten!$G14)+V$14*LOG(Grunddaten!$F14)+V$15*LOG(Grunddaten!$H14)","v":14.336943963572482},37.729170629059716]
[{"$f":"Grunddaten!C15","v":"KSWABL12001"},{"$f":"B$12+B$13*LOG(Grunddaten!$G15)+B$14*LOG(Grunddaten!$F15)+B$15*LOG(Grunddaten!$H15)","v":10.682506011965595},{"$f":"C$12+C$13*LOG(Grunddaten!$G15)+C$14*LOG(Grunddaten!$F15)+C$15*LOG(Grunddaten!$H15)","v":11.062524988166668},{"$f":"D$12+D$13*LOG(Grunddaten!$G15)+D$14*LOG(Grunddaten!$F15)+D$15*LOG(Grunddaten!$H15)","v":14.317205801033793},{"$f":"E$12+E$13*LOG(Grunddaten!$G15)+E$14*LOG(Grunddaten!$F15)+E$15*LOG(Grunddaten!$H15)","v":22.440948345074951},{"$f":"F$12+F$13*LOG(Grunddaten!$G15)+F$14*LOG(Grunddaten!$F15)+F$15*LOG(Grunddaten!$H15)","v":27.772425915328988},{"$f":"G$12+G$13*LOG(Grunddaten!$G15)+G$14*LOG(Grunddaten!$F15)+G$15*LOG(Grunddaten!$H15)","v":26.720429350507253},{"$f":"H$12+H$13*LOG(Grunddaten!$G15)+H$14*LOG(Grunddaten!$F15)+H$15*LOG(Grunddaten!$H15)","v":25.140433396089445},{"$f":"I$12+I$13*LOG(Grunddaten!$G15)+I$14*LOG(Grunddaten!$F15)+I$15*LOG(Grunddaten!$H15)","v":23.748974138226544},{"$f":"J$12+J$13*LOG(Grunddaten!$G15)+J$14*LOG(Grunddaten!$F15)+J$15*LOG(Grunddaten!$H15)","v":26.857342693601616},{"$f":"K$12+K$13*LOG(Grunddaten!$G15)+K$14*LOG(Grunddaten!$F15)+K$15*LOG(Grunddaten!$H15)","v":27.477686972357773},{"$f":"L$12+L$13*LOG(Grunddaten!$G15)+L$14*LOG(Grunddaten!$F15)+L$15*LOG(Grunddaten!$H15)","v":24.107351664881783},{"$f":"M$12+M$13*LOG(Grunddaten!$G15)+M$14*LOG(Grunddaten!$F15)+M$15*LOG(Grunddaten!$H15)","v":20.834892982101326},{"$f":"N$12+N$13*LOG(Grunddaten!$G15)+N$14*LOG(Grunddaten!$F15)+N$15*LOG(Grunddaten!$H15)","v":19.121724960627702},{"$f":"O$12+O$13*LOG(Grunddaten!$G15)+O$14*LOG(Grunddaten!$F15)+O$15*LOG(Grunddaten!$H15)","v":17.362026833490962},{"$f":"P$12+P$13*LOG(Grunddaten!$G15)+P$14*LOG(Grunddaten!$F15)+P$15*LOG(Grunddaten!$H15)","v":17.314138370674851},{"$f":"Q$12+Q$13*LOG(Grunddaten!$G15)+Q$14*LOG(Grunddaten!$F15)+Q$15*LOG(Grunddaten!$H15)","v":18.430859487268275},{"$f":"R$12+R$13*LOG(Grunddaten!$G15)+R$14*LOG(Grunddaten!$F15)+R$15*LOG(Grunddaten!$H15)","v":15.826926625783088},{"$f":"S$12+S$13*LOG(Grunddaten!$G15)+S$14*LOG(Grunddaten!$F15)+S$15*LOG(Grunddaten!$H15)","v":12.967021426846703},{"$f":"T$12+T$13*LOG(Grunddaten!$G15)+T$14*LOG(Grunddaten!$F15)+T$15*LOG(Grunddaten!$H15)","v":12.664093851566053},{"$f":"U$12+U$13*LOG(Grunddaten!$G15)+U$14*LOG(Grunddaten!$F15)+U$15*LOG(Grunddaten!$H15)","v":13.103416167285658},{"$f":"V$12+V$13*LOG(Grunddaten!$G15)+V$14*LOG(Grunddaten!$F15)+V$15*LOG(Grunddaten!$H15)","v":14.363890056489838},35.642429676534569]
[{"$f":"Grunddaten!C16","v":"KSWABL5002"},{"$f":"B54","v":7.9079195299280824},{"$f":"C54","v":9.1730474620568199},8.6093382505645106,13.488851427134893,18.764869343653405,20.902718092594881,20.5713487401561,16.728651498837642,17.00273761990622,16.123409182931084,12.666836232541996,10.562196624584526,9.2214059078186974,9.1597813070911513,10.157944122796771,10.620976305761952,10.894020319533759,10.837510635546279,11.893804380159928,12.994478670208467,14.256868086711499,28.125521163272186]
[{"$f":"Grunddaten!C17","v":"KSWABL8002"},{"$f":"B$16+B$17*LOG(Grunddaten!$G17)+B$18*LOG(Grunddaten!$F17)+B$19*LOG(Grunddaten!$H17)","v":9.5468818581306572},{"$f":"C$16+C$17*LOG(Grunddaten!$G17)+C$18*LOG(Grunddaten!$F17)+C$19*LOG(Grunddaten!$H17)","v":11.154404024962989},{"$f":"D$16+D$17*LOG(Grunddaten!$G17)+D$18*LOG(Grunddaten!$F17)+D$19*LOG(Grunddaten!$H17)","v":9.968837332956884},{"$f":"E$16+E$17*LOG(Grunddaten!$G17)+E$18*LOG(Grunddaten!$F17)+E$19*LOG(Grunddaten!$H17)","v":17.116349933796606},{"$f":"F$16+F$17*LOG(Grunddaten!$G17)+F$18*LOG(Grunddaten!$F17)+F$19*LOG(Grunddaten!$H17)","v":22.731949155165342},{"$f":"G$16+G$17*LOG(Grunddaten!$G17)+G$18*LOG(Grunddaten!$F17)+G$19*LOG(Grunddaten!$H17)","v":23.531521066074916},{"$f":"H$16+H$17*LOG(Grunddaten!$G17)+H$18*LOG(Grunddaten!$F17)+H$19*LOG(Grunddaten!$H17)","v":22.156620349903655},{"$f":"I$16+I$17*LOG(Grunddaten!$G17)+I$18*LOG(Grunddaten!$F17)+I$19*LOG(Grunddaten!$H17)","v":21.716243706769966},{"$f":"J$16+J$17*LOG(Grunddaten!$G17)+J$18*LOG(Grunddaten!$F17)+J$19*LOG(Grunddaten!$H17)","v":22.353896425121953},{"$f":"K$16+K$17*LOG(Grunddaten!$G17)+K$18*LOG(Grunddaten!$F17)+K$19*LOG(Grunddaten!$H17)","v":21.70464234959325},{"$f":"L$16+L$17*LOG(Grunddaten!$G17)+L$18*LOG(Grunddaten!$F17)+L$19*LOG(Grunddaten!$H17)","v":19.332695198936658},{"$f":"M$16+M$17*LOG(Grunddaten!$G17)+M$18*LOG(Grunddaten!$F17)+M$19*LOG(Grunddaten!$H17)","v":16.461299821281919},{"$f":"N$16+N$17*LOG(Grunddaten!$G17)+N$18*LOG(Grunddaten!$F17)+N$19*LOG(Grunddaten!$H17)","v":14.705836022518286},{"$f":"O$16+O$17*LOG(Grunddaten!$G17)+O$18*LOG(Grunddaten!$F17)+O$19*LOG(Grunddaten!$H17)","v":13.748004382841589},{"$f":"P$16+P$17*LOG(Grunddaten!$G17)+P$18*LOG(Grunddaten!$F17)+P$19*LOG(Grunddaten!$H17)","v":13.442326923578086},{"$f":"Q$16+Q$17*LOG(Grunddaten!$G17)+Q$18*LOG(Grunddaten!$F17)+Q$19*LOG(Grunddaten!$H17)","v":12.855526685570473},{"$f":"R$16+R$17*LOG(Grunddaten!$G17)+R$18*LOG(Grunddaten!$F17)+R$19*LOG(Grunddaten!$H17)","v":12.068481926211151},{"$f":"S$16+S$17*LOG(Grunddaten!$G17)+S$18*LOG(Grunddaten!$F17)+S$19*LOG(Grunddaten!$H17)","v":11.352379578520797},{"$f":"T$16+T$17*LOG(Grunddaten!$G17)+T$18*LOG(Grunddaten!$F17)+T$19*LOG(Grunddaten!$H17)","v":12.054505950205513},{"$f":"U$16+U$17*LOG(Grunddaten!$G17)+U$18*LOG(Grunddaten!$F17)+U$19*LOG(Grunddaten!$H17)","v":13.046207628485911},{"$f":"V$16+V$17*LOG(Grunddaten!$G17)+V$18*LOG(Grunddaten!$F17)+V$19*LOG(Grunddaten!$H17)","v":14.444927948283498},31.607117176237537]
[{"$f":"Grunddaten!C18","v":"KSWABL10002"},{"$f":"B$16+B$17*LOG(Grunddaten!$G18)+B$18*LOG(Grunddaten!$F18)+B$19*LOG(Grunddaten!$H18)","v":7.9079195299280824},{"$f":"C$16+C$17*LOG(Grunddaten!$G18)+C$18*LOG(Grunddaten!$F18)+C$19*LOG(Grunddaten!$H18)","v":9.1730474620568199},{"$f":"D$16+D$17*LOG(Grunddaten!$G18)+D$18*LOG(Grunddaten!$F18)+D$19*LOG(Grunddaten!$H18)","v":8.6093382505645106},{"$f":"E$16+E$17*LOG(Grunddaten!$G18)+E$18*LOG(Grunddaten!$F18)+E$19*LOG(Grunddaten!$H18)","v":13.488851427134893},{"$f":"F$16+F$17*LOG(Grunddaten!$G18)+F$18*LOG(Grunddaten!$F18)+F$19*LOG(Grunddaten!$H18)","v":18.764869343653405},{"$f":"G$16+G$17*LOG(Grunddaten!$G18)+G$18*LOG(Grunddaten!$F18)+G$19*LOG(Grunddaten!$H18)","v":20.902718092594881},{"$f":"H$16+H$17*LOG(Grunddaten!$G18)+H$18*LOG(Grunddaten!$F18)+H$19*LOG(Grunddaten!$H18)","v":20.5713487401561},{"$f":"I$16+I$17*LOG(Grunddaten!$G18)+I$18*LOG(Grunddaten!$F18)+I$19*LOG(Grunddaten!$H18)","v":16.728651498837642},{"$f":"J$16+J$17*LOG(Grunddaten!$G18)+J$18*LOG(Grunddaten!$F18)+J$19*LOG(Grunddaten!$H18)","v":17.00273761990622},{"$f":"K$16+K$17*LOG(Grunddaten!$G18)+K$18*LOG(Grunddaten!$F18)+K$19*LOG(Grunddaten!$H18)","v":16.123409182931084},{"$f":"L$16+L$17*LOG(Grunddaten!$G18)+L$18*LOG(Grunddaten!$F18)+L$19*LOG(Grunddaten!$H18)","v":12.666836232541996},{"$f":"M$16+M$17*LOG(Grunddaten!$G18)+M$18*LOG(Grunddaten!$F18)+M$19*LOG(Grunddaten!$H18)","v":10.562196624584526},{"$f":"N$16+N$17*LOG(Grunddaten!$G18)+N$18*LOG(Grunddaten!$F18)+N$19*LOG(Grunddaten!$H18)","v":9.2214059078186974},{"$f":"O$16+O$17*LOG(Grunddaten!$G18)+O$18*LOG(Grunddaten!$F18)+O$19*LOG(Grunddaten!$H18)","v":9.1597813070911513},{"$f":"P$16+P$17*LOG(Grunddaten!$G18)+P$18*LOG(Grunddaten!$F18)+P$19*LOG(Grunddaten!$H18)","v":10.157944122796771},{"$f":"Q$16+Q$17*LOG(Grunddaten!$G18)+Q$18*LOG(Grunddaten!$F18)+Q$19*LOG(Grunddaten!$H18)","v":10.620976305761952},{"$f":"R$16+R$17*LOG(Grunddaten!$G18)+R$18*LOG(Grunddaten!$F18)+R$19*LOG(Grunddaten!$H18)","v":10.894020319533759},{"$f":"S$16+S$17*LOG(Grunddaten!$G18)+S$18*LOG(Grunddaten!$F18)+S$19*LOG(Grunddaten!$H18)","v":10.837510635546279},{"$f":"T$16+T$17*LOG(Grunddaten!$G18)+T$18*LOG(Grunddaten!$F18)+T$19*LOG(Grunddaten!$H18)","v":11.893804380159928},{"$f":"U$16+U$17*LOG(Grunddaten!$G18)+U$18*LOG(Grunddaten!$F18)+U$19*LOG(Grunddaten!$H18)","v":12.994478670208467},{"$f":"V$16+V$17*LOG(Grunddaten!$G18)+V$18*LOG(Grunddaten!$F18)+V$19*LOG(Grunddaten!$H18)","v":14.256868086711499},28.125521163272186]
[{"$f":"Grunddaten!C19","v":"KSWABL12002"},{"$f":"B$16+B$17*LOG(Grunddaten!$G19)+B$18*LOG(Grunddaten!$F19)+B$19*LOG(Grunddaten!$H19)","v":6.1559443122586091},{"$f":"C$16+C$17*LOG(Grunddaten!$G19)+C$18*LOG(Grunddaten!$F19)+C$19*LOG(Grunddaten!$H19)","v":8.6435433655338905},{"$f":"D$16+D$17*LOG(Grunddaten!$G19)+D$18*LOG(Grunddaten!$F19)+D$19*LOG(Grunddaten!$H19)","v":6.2263313990271456},{"$f":"E$16+E$17*LOG(Grunddaten!$G19)+E$18*LOG(Grunddaten!$F19)+E$19*LOG(Grunddaten!$H19)","v":11.53216497017501},{"$f":"F$16+F$17*LOG(Grunddaten!$G19)+F$18*LOG(Grunddaten!$F19)+F$19*LOG(Grunddaten!$H19)","v":16.819383041877728},{"$f":"G$16+G$17*LOG(Grunddaten!$G19)+G$18*LOG(Grunddaten!$F19)+G$19*LOG(Grunddaten!$H19)","v":16.356943462160885},{"$f":"H$16+H$17*LOG(Grunddaten!$G19)+H$18*LOG(Grunddaten!$F19)+H$19*LOG(Grunddaten!$H19)","v":14.743803144592919},{"$f":"I$16+I$17*LOG(Grunddaten!$G19)+I$18*LOG(Grunddaten!$F19)+I$19*LOG(Grunddaten!$H19)","v":12.179078136914628},{"$f":"J$16+J$17*LOG(Grunddaten!$G19)+J$18*LOG(Grunddaten!$F19)+J$19*LOG(Grunddaten!$H19)","v":11.32671388604083},{"$f":"K$16+K$17*LOG(Grunddaten!$G19)+K$18*LOG(Grunddaten!$F19)+K$19*LOG(Grunddaten!$H19)","v":9.2780623601400229},{"$f":"L$16+L$17*LOG(Grunddaten!$G19)+L$18*LOG(Grunddaten!$F19)+L$19*LOG(Grunddaten!$H19)","v":7.4455021922554563},{"$f":"M$16+M$17*LOG(Grunddaten!$G19)+M$18*LOG(Grunddaten!$F19)+M$19*LOG(Grunddaten!$H19)","v":6.139656392549055},{"$f":"N$16+N$17*LOG(Grunddaten!$G19)+N$18*LOG(Grunddaten!$F19)+N$19*LOG(Grunddaten!$H19)","v":5.7174737949596643},{"$f":"O$16+O$17*LOG(Grunddaten!$G19)+O$18*LOG(Grunddaten!$F19)+O$19*LOG(Grunddaten!$H19)","v":6.3607516808309619},{"$f":"P$16+P$17*LOG(Grunddaten!$G19)+P$18*LOG(Grunddaten!$F19)+P$19*LOG(Grunddaten!$H19)","v":7.3317723053749173},{"$f":"Q$16+Q$17*LOG(Grunddaten!$G19)+Q$18*LOG(Grunddaten!$F19)+Q$19*LOG(Grunddaten!$H19)","v":8.5132333608145601},{"$f":"R$16+R$17*LOG(Grunddaten!$G19)+R$18*LOG(Grunddaten!$F19)+R$19*LOG(Grunddaten!$H19)","v":9.945371732919412},{"$f":"S$16+S$17*LOG(Grunddaten!$G19)+S$18*LOG(Grunddaten!$F19)+S$19*LOG(Grunddaten!$H19)","v":10.620539726348522},{"$f":"T$16+T$17*LOG(Grunddaten!$G19)+T$18*LOG(Grunddaten!$F19)+T$19*LOG(Grunddaten!$H19)","v":11.828396032571197},{"$f":"U$16+U$17*LOG(Grunddaten!$G19)+U$18*LOG(Grunddaten!$F19)+U$19*LOG(Grunddaten!$H19)","v":12.977899076722206},{"$f":"V$16+V$17*LOG(Grunddaten!$G19)+V$18*LOG(Grunddaten!$F19)+V$19*LOG(Grunddaten!$H19)","v":14.377892899369188},24.823966463954953]
[{"$f":"Grunddaten!C20","v":"KSW-1LWZUL8001"},{"$f":"B$20+B$21*LOG(Grunddaten!$G20)+B$22*LOG(Grunddaten!$F20)+B$23*LOG(Grunddaten!$H20)","v":5.5939401812308578},{"$f":"C$20+C$21*LOG(Grunddaten!$G20)+C$22*LOG(Grunddaten!$F20)+C$23*LOG(Grunddaten!$H20)","v":6.849902846703686},{"$f":"D$20+D$21*LOG(Grunddaten!$G20)+D$22*LOG(Grunddaten!$F20)+D$23*LOG(Grunddaten!$H20)","v":7.7845076130420923},{"$f":"E$20+E$21*LOG(Grunddaten!$G20)+E$22*LOG(Grunddaten!$F20)+E$23*LOG(Grunddaten!$H20)","v":14.492905798297468},{"$f":"F$20+F$21*LOG(Grunddaten!$G20)+F$22*LOG(Grunddaten!$F20)+F$23*LOG(Grunddaten!$H20)","v":15.976324911146301},{"$f":"G$20+G$21*LOG(Grunddaten!$G20)+G$22*LOG(Grunddaten!$F20)+G$23*LOG(Grunddaten!$H20)","v":15.047874523376617},{"$f":"H$20+H$21*LOG(Grunddaten!$G20)+H$22*LOG(Grunddaten!$F20)+H$23*LOG(Grunddaten!$H20)","v":11.909075781820722},{"$f":"I$20+I$21*LOG(Grunddaten!$G20)+I$22*LOG(Grunddaten!$F20)+I$23*LOG(Grunddaten!$H20)","v":13.369559033492514},{"$f":"J$20+J$21*LOG(Grunddaten!$G20)+J$22*LOG(Grunddaten!$F20)+J$23*LOG(Grunddaten!$H20)","v":15.885850470191334},{"$f":"K$20+K$21*LOG(Grunddaten!$G20)+K$22*LOG(Grunddaten!$F20)+K$23*LOG(Grunddaten!$H20)","v":14.431698447027451},{"$f":"L$20+L$21*LOG(Grunddaten!$G20)+L$22*LOG(Grunddaten!$F20)+L$23*LOG(Grunddaten!$H20)","v":12.667586919183675},{"$f":"M$20+M$21*LOG(Grunddaten!$G20)+M$22*LOG(Grunddaten!$F20)+M$23*LOG(Grunddaten!$H20)","v":9.774190981268351},{"$f":"N$20+N$21*LOG(Grunddaten!$G20)+N$22*LOG(Grunddaten!$F20)+N$23*LOG(Grunddaten!$H20)","v":7.6978654381422444},{"$f":"O$20+O$21*LOG(Grunddaten!$G20)+O$22*LOG(Grunddaten!$F20)+O$23*LOG(Grunddaten!$H20)","v":5.9542136653144899},{"$f":"P$20+P$21*LOG(Grunddaten!$G20)+P$22*LOG(Grunddaten!$F20)+P$23*LOG(Grunddaten!$H20)","v":6.2978141739338156},{"$f":"Q$20+Q$21*LOG(Grunddaten!$G20)+Q$22*LOG(Grunddaten!$F20)+Q$23*LOG(Grunddaten!$H20)","v":6.8505527746359132},{"$f":"R$20+R$21*LOG(Grunddaten!$G20)+R$22*LOG(Grunddaten!$F20)+R$23*LOG(Grunddaten!$H20)","v":7.7494360229352983},{"$f":"S$20+S$21*LOG(Grunddaten!$G20)+S$22*LOG(Grunddaten!$F20)+S$23*LOG(Grunddaten!$H20)","v":9.8328838003403796},{"$f":"T$20+T$21*LOG(Grunddaten!$G20)+T$22*LOG(Grunddaten!$F20)+T$23*LOG(Grunddaten!$H20)","v":13.019153285944361},{"$f":"U$20+U$21*LOG(Grunddaten!$G20)+U$22*LOG(Grunddaten!$F20)+U$23*LOG(Grunddaten!$H20)","v":15.151889333823856},{"$f":"V$20+V$21*LOG(Grunddaten!$G20)+V$22*LOG(Grunddaten!$F20)+V$23*LOG(Grunddaten!$H20)","v":16.574277278472707},25.78246284924073]
[{"$f":"Grunddaten!C21","v":"KSW-1LWZUL10001"},{"$f":"B$20+B$21*LOG(Grunddaten!$G21)+B$22*LOG(Grunddaten!$F21)+B$23*LOG(Grunddaten!$H21)","v":4.2240959497976434},{"$f":"C$20+C$21*LOG(Grunddaten!$G21)+C$22*LOG(Grunddaten!$F21)+C$23*LOG(Grunddaten!$H21)","v":6.2389334770086116},{"$f":"D$20+D$21*LOG(Grunddaten!$G21)+D$22*LOG(Grunddaten!$F21)+D$23*LOG(Grunddaten!$H21)","v":7.8380115881623187},{"$f":"E$20+E$21*LOG(Grunddaten!$G21)+E$22*LOG(Grunddaten!$F21)+E$23*LOG(Grunddaten!$H21)","v":11.12959216128765},{"$f":"F$20+F$21*LOG(Grunddaten!$G21)+F$22*LOG(Grunddaten!$F21)+F$23*LOG(Grunddaten!$H21)","v":12.606627330223619},{"$f":"G$20+G$21*LOG(Grunddaten!$G21)+G$22*LOG(Grunddaten!$F21)+G$23*LOG(Grunddaten!$H21)","v":10.994717207634377},{"$f":"H$20+H$21*LOG(Grunddaten!$G21)+H$22*LOG(Grunddaten!$F21)+H$23*LOG(Grunddaten!$H21)","v":9.3452114478369879},{"$f":"I$20+I$21*LOG(Grunddaten!$G21)+I$22*LOG(Grunddaten!$F21)+I$23*LOG(Grunddaten!$H21)","v":8.6599578595603273},{"$f":"J$20+J$21*LOG(Grunddaten!$G21)+J$22*LOG(Grunddaten!$F21)+J$23*LOG(Grunddaten!$H21)","v":9.5313055165417619},{"$f":"K$20+K$21*LOG(Grunddaten!$G21)+K$22*LOG(Grunddaten!$F21)+K$23*LOG(Grunddaten!$H21)","v":7.4091712827487468},{"$f":"L$20+L$21*LOG(Grunddaten!$G21)+L$22*LOG(Grunddaten!$F21)+L$23*LOG(Grunddaten!$H21)","v":5.0800981695953293},{"$f":"M$20+M$21*LOG(Grunddaten!$G21)+M$22*LOG(Grunddaten!$F21)+M$23*LOG(Grunddaten!$H21)","v":1.314867451270874},{"$f":"N$20+N$21*LOG(Grunddaten!$G21)+N$22*LOG(Grunddaten!$F21)+N$23*LOG(Grunddaten!$H21)","v":-0.9532683735295211},{"$f":"O$20+O$21*LOG(Grunddaten!$G21)+O$22*LOG(Grunddaten!$F21)+O$23*LOG(Grunddaten!$H21)","v":-2.348953161355162},{"$f":"P$20+P$21*LOG(Grunddaten!$G21)+P$22*LOG(Grunddaten!$F21)+P$23*LOG(Grunddaten!$H21)","v":-1.0375913602254454},{"$f":"Q$20+Q$21*LOG(Grunddaten!$G21)+Q$22*LOG(Grunddaten!$F21)+Q$23*LOG(Grunddaten!$H21)","v":1.2352834993051398},{"$f":"R$20+R$21*LOG(Grunddaten!$G21)+R$22*LOG(Grunddaten!$F21)+R$23*LOG(Grunddaten!$H21)","v":3.8442905640711427},{"$f":"S$20+S$21*LOG(Grunddaten!$G21)+S$22*LOG(Grunddaten!$F21)+S$23*LOG(Grunddaten!$H21)","v":7.59272062895975},{"$f":"T$20+T$21*LOG(Grunddaten!$G21)+T$22*LOG(Grunddaten!$F21)+T$23*LOG(Grunddaten!$H21)","v":12.090392959512922},{"$f":"U$20+U$21*LOG(Grunddaten!$G21)+U$22*LOG(Grunddaten!$F21)+U$23*LOG(Grunddaten!$H21)","v":15.071967869564062},{"$f":"V$20+V$21*LOG(Grunddaten!$G21)+V$22*LOG(Grunddaten!$F21)+V$23*LOG(Grunddaten!$H21)","v":16.495015028103321},22.929726808938028]
[{"$f":"Grunddaten!C22","v":"KSW-1LWZUL12001"},{"$f":"B$20+B$21*LOG(Grunddaten!$G22)+B$22*LOG(Grunddaten!$F22)+B$23*LOG(Grunddaten!$H22)","v":2.5750649419041052},{"$f":"C$20+C$21*LOG(Grunddaten!$G22)+C$22*LOG(Grunddaten!$F22)+C$23*LOG(Grunddaten!$H22)","v":2.3464189384479397},{"$f":"D$20+D$21*LOG(Grunddaten!$G22)+D$22*LOG(Grunddaten!$F22)+D$23*LOG(Grunddaten!$H22)","v":6.8962379418184501},{"$f":"E$20+E$21*LOG(Grunddaten!$G22)+E$22*LOG(Grunddaten!$F22)+E$23*LOG(Grunddaten!$H22)","v":9.606354900660719},{"$f":"F$20+F$21*LOG(Grunddaten!$G22)+F$22*LOG(Grunddaten!$F22)+F$23*LOG(Grunddaten!$H22)","v":9.5377003835113285},{"$f":"G$20+G$21*LOG(Grunddaten!$G22)+G$22*LOG(Grunddaten!$F22)+G$23*LOG(Grunddaten!$H22)","v":6.7381918625830721},{"$f":"H$20+H$21*LOG(Grunddaten!$G22)+H$22*LOG(Grunddaten!$F22)+H$23*LOG(Grunddaten!$H22)","v":4.9852424653586356},{"$f":"I$20+I$21*LOG(Grunddaten!$G22)+I$22*LOG(Grunddaten!$F22)+I$23*LOG(Grunddaten!$H22)","v":5.9181921489824774},{"$f":"J$20+J$21*LOG(Grunddaten!$G22)+J$22*LOG(Grunddaten!$F22)+J$23*LOG(Grunddaten!$H22)","v":6.438682678376102},{"$f":"K$20+K$21*LOG(Grunddaten!$G22)+K$22*LOG(Grunddaten!$F22)+K$23*LOG(Grunddaten!$H22)","v":4.4822893775235348},{"$f":"L$20+L$21*LOG(Grunddaten!$G22)+L$22*LOG(Grunddaten!$F22)+L$23*LOG(Grunddaten!$H22)","v":0.49118589690493186},{"$f":"M$20+M$21*LOG(Grunddaten!$G22)+M$22*LOG(Grunddaten!$F22)+M$23*LOG(Grunddaten!$H22)","v":-4.3379256032045532},{"$f":"N$20+N$21*LOG(Grunddaten!$G22)+N$22*LOG(Grunddaten!$F22)+N$23*LOG(Grunddaten!$H22)","v":-6.7284759608848965},{"$f":"O$20+O$21*LOG(Grunddaten!$G22)+O$22*LOG(Grunddaten!$F22)+O$23*LOG(Grunddaten!$H22)","v":-7.6956798653820764},{"$f":"P$20+P$21*LOG(Grunddaten!$G22)+P$22*LOG(Grunddaten!$F22)+P$23*LOG(Grunddaten!$H22)","v":-6.1559674086927743},{"$f":"Q$20+Q$21*LOG(Grunddaten!$G22)+Q$22*LOG(Grunddaten!$F22)+Q$23*LOG(Grunddaten!$H22)","v":-4.37890313868356},{"$f":"R$20+R$21*LOG(Grunddaten!$G22)+R$22*LOG(Grunddaten!$F22)+R$23*LOG(Grunddaten!$H22)","v":-9.1169362120515629E-2},{"$f":"S$20+S$21*LOG(Grunddaten!$G22)+S$22*LOG(Grunddaten!$F22)+S$23*LOG(Grunddaten!$H22)","v":5.1777057737927841},{"$f":"T$20+T$21*LOG(Grunddaten!$G22)+T$22*LOG(Grunddaten!$F22)+T$23*LOG(Grunddaten!$H22)","v":11.636089590652755},{"$f":"U$20+U$21*LOG(Grunddaten!$G22)+U$22*LOG(Grunddaten!$F22)+U$23*LOG(Grunddaten!$H22)","v":16.052321949032322},{"$f":"V$20+V$21*LOG(Grunddaten!$G22)+V$22*LOG(Grunddaten!$F22)+V$23*LOG(Grunddaten!$H22)","v":17.77465608663929},22.22861882536845]
[{"$f":"Grunddaten!C23","v":"KSW-1LWZUL8002"},{"$f":"B$24+B$25*LOG(Grunddaten!$G23)+B$26*LOG(Grunddaten!$F23)+B$27*LOG(Grunddaten!$H23)","v":10.203237068211308},{"$f":"C$24+C$25*LOG(Grunddaten!$G23)+C$26*LOG(Grunddaten!$F23)+C$27*LOG(Grunddaten!$H23)","v":4.6540448764283511},{"$f":"D$24+D$25*LOG(Grunddaten!$G23)+D$26*LOG(Grunddaten!$F23)+D$27*LOG(Grunddaten!$H23)","v":3.3699466544917236},{"$f":"E$24+E$25*LOG(Grunddaten!$G23)+E$26*LOG(Grunddaten!$F23)+E$27*LOG(Grunddaten!$H23)","v":7.6196898844761876},{"$f":"F$24+F$25*LOG(Grunddaten!$G23)+F$26*LOG(Grunddaten!$F23)+F$27*LOG(Grunddaten!$H23)","v":7.884048082764096},{"$f":"G$24+G$25*LOG(Grunddaten!$G23)+G$26*LOG(Grunddaten!$F23)+G$27*LOG(Grunddaten!$H23)","v":9.5274938648903245},{"$f":"H$24+H$25*LOG(Grunddaten!$G23)+H$26*LOG(Grunddaten!$F23)+H$27*LOG(Grunddaten!$H23)","v":5.645040765004647},{"$f":"I$24+I$25*LOG(Grunddaten!$G23)+I$26*LOG(Grunddaten!$F23)+I$27*LOG(Grunddaten!$H23)","v":3.9617224662853241},{"$f":"J$24+J$25*LOG(Grunddaten!$G23)+J$26*LOG(Grunddaten!$F23)+J$27*LOG(Grunddaten!$H23)","v":5.4209971666223105},{"$f":"K$24+K$25*LOG(Grunddaten!$G23)+K$26*LOG(Grunddaten!$F23)+K$27*LOG(Grunddaten!$H23)","v":5.2740110067686459},{"$f":"L$24+L$25*LOG(Grunddaten!$G23)+L$26*LOG(Grunddaten!$F23)+L$27*LOG(Grunddaten!$H23)","v":2.4217702157655197},{"$f":"M$24+M$25*LOG(Grunddaten!$G23)+M$26*LOG(Grunddaten!$F23)+M$27*LOG(Grunddaten!$H23)","v":-0.67740172960029099},{"$f":"N$24+N$25*LOG(Grunddaten!$G23)+N$26*LOG(Grunddaten!$F23)+N$27*LOG(Grunddaten!$H23)","v":-2.5680859405192251},{"$f":"O$24+O$25*LOG(Grunddaten!$G23)+O$26*LOG(Grunddaten!$F23)+O$27*LOG(Grunddaten!$H23)","v":-3.8494395573732874},{"$f":"P$24+P$25*LOG(Grunddaten!$G23)+P$26*LOG(Grunddaten!$F23)+P$27*LOG(Grunddaten!$H23)","v":-2.41949193582224},{"$f":"Q$24+Q$25*LOG(Grunddaten!$G23)+Q$26*LOG(Grunddaten!$F23)+Q$27*LOG(Grunddaten!$H23)","v":1.0057184149921279},{"$f":"R$24+R$25*LOG(Grunddaten!$G23)+R$26*LOG(Grunddaten!$F23)+R$27*LOG(Grunddaten!$H23)","v":4.2059494797122525},{"$f":"S$24+S$25*LOG(Grunddaten!$G23)+S$26*LOG(Grunddaten!$F23)+S$27*LOG(Grunddaten!$H23)","v":8.3132141507710244},{"$f":"T$24+T$25*LOG(Grunddaten!$G23)+T$26*LOG(Grunddaten!$F23)+T$27*LOG(Grunddaten!$H23)","v":13.036034409960671},{"$f":"U$24+U$25*LOG(Grunddaten!$G23)+U$26*LOG(Grunddaten!$F23)+U$27*LOG(Grunddaten!$H23)","v":15.744625287846681},{"$f":"V$24+V$25*LOG(Grunddaten!$G23)+V$26*LOG(Grunddaten!$F23)+V$27*LOG(Grunddaten!$H23)","v":17.366061082617904},22.466827706784205]
[{"$f":"Grunddaten!C24","v":"KSW-1LWZUL10002"},{"$f":"B$24+B$25*LOG(Grunddaten!$G24)+B$26*LOG(Grunddaten!$F24)+B$27*LOG(Grunddaten!$H24)","v":5.4888369749901571},{"$f":"C$24+C$25*LOG(Grunddaten!$G24)+C$26*LOG(Grunddaten!$F24)+C$27*LOG(Grunddaten!$H24)","v":4.0224497974290543},{"$f":"D$24+D$25*LOG(Grunddaten!$G24)+D$26*LOG(Grunddaten!$F24)+D$27*LOG(Grunddaten!$H24)","v":-0.84016213874783574},{"$f":"E$24+E$25*LOG(Grunddaten!$G24)+E$26*LOG(Grunddaten!$F24)+E$27*LOG(Grunddaten!$H24)","v":3.9533936844048299},{"$f":"F$24+F$25*LOG(Grunddaten!$G24)+F$26*LOG(Grunddaten!$F24)+F$27*LOG(Grunddaten!$H24)","v":5.1468671489838442},{"$f":"G$24+G$25*LOG(Grunddaten!$G24)+G$26*LOG(Grunddaten!$F24)+G$27*LOG(Grunddaten!$H24)","v":5.4665305120730778},{"$f":"H$24+H$25*LOG(Grunddaten!$G24)+H$26*LOG(Grunddaten!$F24)+H$27*LOG(Grunddaten!$H24)","v":3.5993898889727785},{"$f":"I$24+I$25*LOG(Grunddaten!$G24)+I$26*LOG(Grunddaten!$F24)+I$27*LOG(Grunddaten!$H24)","v":1.4117060911455965},{"$f":"J$24+J$25*LOG(Grunddaten!$G24)+J$26*LOG(Grunddaten!$F24)+J$27*LOG(Grunddaten!$H24)","v":0.82113718745732456},{"$f":"K$24+K$25*LOG(Grunddaten!$G24)+K$26*LOG(Grunddaten!$F24)+K$27*LOG(Grunddaten!$H24)","v":-1.1825094053718885},{"$f":"L$24+L$25*LOG(Grunddaten!$G24)+L$26*LOG(Grunddaten!$F24)+L$27*LOG(Grunddaten!$H24)","v":-5.6491521883641553},{"$f":"M$24+M$25*LOG(Grunddaten!$G24)+M$26*LOG(Grunddaten!$F24)+M$27*LOG(Grunddaten!$H24)","v":-9.372785775828703},{"$f":"N$24+N$25*LOG(Grunddaten!$G24)+N$26*LOG(Grunddaten!$F24)+N$27*LOG(Grunddaten!$H24)","v":-11.153479342492574},{"$f":"O$24+O$25*LOG(Grunddaten!$G24)+O$26*LOG(Grunddaten!$F24)+O$27*LOG(Grunddaten!$H24)","v":-11.447745297153304},{"$f":"P$24+P$25*LOG(Grunddaten!$G24)+P$26*LOG(Grunddaten!$F24)+P$27*LOG(Grunddaten!$H24)","v":-8.2937613804235824},{"$f":"Q$24+Q$25*LOG(Grunddaten!$G24)+Q$26*LOG(Grunddaten!$F24)+Q$27*LOG(Grunddaten!$H24)","v":-3.3438721775552835},{"$f":"R$24+R$25*LOG(Grunddaten!$G24)+R$26*LOG(Grunddaten!$F24)+R$27*LOG(Grunddaten!$H24)","v":2.5600370891349087},{"$f":"S$24+S$25*LOG(Grunddaten!$G24)+S$26*LOG(Grunddaten!$F24)+S$27*LOG(Grunddaten!$H24)","v":8.1996047229760478},{"$f":"T$24+T$25*LOG(Grunddaten!$G24)+T$26*LOG(Grunddaten!$F24)+T$27*LOG(Grunddaten!$H24)","v":14.145743286159913},{"$f":"U$24+U$25*LOG(Grunddaten!$G24)+U$26*LOG(Grunddaten!$F24)+U$27*LOG(Grunddaten!$H24)","v":18.203346411479885},{"$f":"V$24+V$25*LOG(Grunddaten!$G24)+V$26*LOG(Grunddaten!$F24)+V$27*LOG(Grunddaten!$H24)","v":20.189500240620347},23.577873618755348]
[{"$f":"Grunddaten!C25","v":"KSW-1LWZUL12002"},{"$f":"B$24+B$25*LOG(Grunddaten!$G25)+B$26*LOG(Grunddaten!$F25)+B$27*LOG(Grunddaten!$H25)","v":-5.6392963904968951E-2},{"$f":"C$24+C$25*LOG(Grunddaten!$G25)+C$26*LOG(Grunddaten!$F25)+C$27*LOG(Grunddaten!$H25)","v":0.96659249770725353},{"$f":"D$24+D$25*LOG(Grunddaten!$G25)+D$26*LOG(Grunddaten!$F25)+D$27*LOG(Grunddaten!$H25)","v":-2.1519274277627858},{"$f":"E$24+E$25*LOG(Grunddaten!$G25)+E$26*LOG(Grunddaten!$F25)+E$27*LOG(Grunddaten!$H25)","v":4.2568723846562619},{"$f":"F$24+F$25*LOG(Grunddaten!$G25)+F$26*LOG(Grunddaten!$F25)+F$27*LOG(Grunddaten!$H25)","v":6.6503028032102094},{"$f":"G$24+G$25*LOG(Grunddaten!$G25)+G$26*LOG(Grunddaten!$F25)+G$27*LOG(Grunddaten!$H25)","v":5.2305822093468208},{"$f":"H$24+H$25*LOG(Grunddaten!$G25)+H$26*LOG(Grunddaten!$F25)+H$27*LOG(Grunddaten!$H25)","v":1.4518890526943729},{"$f":"I$24+I$25*LOG(Grunddaten!$G25)+I$26*LOG(Grunddaten!$F25)+I$27*LOG(Grunddaten!$H25)","v":-0.20804055050700931},{"$f":"J$24+J$25*LOG(Grunddaten!$G25)+J$26*LOG(Grunddaten!$F25)+J$27*LOG(Grunddaten!$H25)","v":-0.86834250138605995},{"$f":"K$24+K$25*LOG(Grunddaten!$G25)+K$26*LOG(Grunddaten!$F25)+K$27*LOG(Grunddaten!$H25)","v":-3.103886564993573},{"$f":"L$24+L$25*LOG(Grunddaten!$G25)+L$26*LOG(Grunddaten!$F25)+L$27*LOG(Grunddaten!$H25)","v":-7.3232212259441098},{"$f":"M$24+M$25*LOG(Grunddaten!$G25)+M$26*LOG(Grunddaten!$F25)+M$27*LOG(Grunddaten!$H25)","v":-10.698917195412776},{"$f":"N$24+N$25*LOG(Grunddaten!$G25)+N$26*LOG(Grunddaten!$F25)+N$27*LOG(Grunddaten!$H25)","v":-12.432584808322929},{"$f":"O$24+O$25*LOG(Grunddaten!$G25)+O$26*LOG(Grunddaten!$F25)+O$27*LOG(Grunddaten!$H25)","v":-12.913647466961805},{"$f":"P$24+P$25*LOG(Grunddaten!$G25)+P$26*LOG(Grunddaten!$F25)+P$27*LOG(Grunddaten!$H25)","v":-11.665106986100859},{"$f":"Q$24+Q$25*LOG(Grunddaten!$G25)+Q$26*LOG(Grunddaten!$F25)+Q$27*LOG(Grunddaten!$H25)","v":-6.8145446225523809},{"$f":"R$24+R$25*LOG(Grunddaten!$G25)+R$26*LOG(Grunddaten!$F25)+R$27*LOG(Grunddaten!$H25)","v":-1.6963335264642154},{"$f":"S$24+S$25*LOG(Grunddaten!$G25)+S$26*LOG(Grunddaten!$F25)+S$27*LOG(Grunddaten!$H25)","v":4.9491092598015882},{"$f":"T$24+T$25*LOG(Grunddaten!$G25)+T$26*LOG(Grunddaten!$F25)+T$27*LOG(Grunddaten!$H25)","v":11.820671775045284},{"$f":"U$24+U$25*LOG(Grunddaten!$G25)+U$26*LOG(Grunddaten!$F25)+U$27*LOG(Grunddaten!$H25)","v":16.172443844902858},{"$f":"V$24+V$25*LOG(Grunddaten!$G25)+V$26*LOG(Grunddaten!$F25)+V$27*LOG(Grunddaten!$H25)","v":18.527438699127572},21.745226105201763]
[{"$f":"Grunddaten!C26","v":"KSW-1LWABL8001"},{"$f":"B$28+B$29*LOG(Grunddaten!$G26)+B$30*LOG(Grunddaten!$F26)+B$31*LOG(Grunddaten!$H26)","v":6.8615869618523},{"$f":"C$28+C$29*LOG(Grunddaten!$G26)+C$30*LOG(Grunddaten!$F26)+C$31*LOG(Grunddaten!$H26)","v":6.8380366501584025},{"$f":"D$28+D$29*LOG(Grunddaten!$G26)+D$30*LOG(Grunddaten!$F26)+D$31*LOG(Grunddaten!$H26)","v":10.069649216396535},{"$f":"E$28+E$29*LOG(Grunddaten!$G26)+E$30*LOG(Grunddaten!$F26)+E$31*LOG(Grunddaten!$H26)","v":17.422018216360684},{"$f":"F$28+F$29*LOG(Grunddaten!$G26)+F$30*LOG(Grunddaten!$F26)+F$31*LOG(Grunddaten!$H26)","v":17.266864628475155},{"$f":"G$28+G$29*LOG(Grunddaten!$G26)+G$30*LOG(Grunddaten!$F26)+G$31*LOG(Grunddaten!$H26)","v":16.473216834151948},{"$f":"H$28+H$29*LOG(Grunddaten!$G26)+H$30*LOG(Grunddaten!$F26)+H$31*LOG(Grunddaten!$H26)","v":14.061662780241207},{"$f":"I$28+I$29*LOG(Grunddaten!$G26)+I$30*LOG(Grunddaten!$F26)+I$31*LOG(Grunddaten!$H26)","v":14.684892376955721},{"$f":"J$28+J$29*LOG(Grunddaten!$G26)+J$30*LOG(Grunddaten!$F26)+J$31*LOG(Grunddaten!$H26)","v":15.37395293223536},{"$f":"K$28+K$29*LOG(Grunddaten!$G26)+K$30*LOG(Grunddaten!$F26)+K$31*LOG(Grunddaten!$H26)","v":13.945676593541076},{"$f":"L$28+L$29*LOG(Grunddaten!$G26)+L$30*LOG(Grunddaten!$F26)+L$31*LOG(Grunddaten!$H26)","v":10.282527903562205},{"$f":"M$28+M$29*LOG(Grunddaten!$G26)+M$30*LOG(Grunddaten!$F26)+M$31*LOG(Grunddaten!$H26)","v":7.6633155251555163},{"$f":"N$28+N$29*LOG(Grunddaten!$G26)+N$30*LOG(Grunddaten!$F26)+N$31*LOG(Grunddaten!$H26)","v":6.9584840789989215},{"$f":"O$28+O$29*LOG(Grunddaten!$G26)+O$30*LOG(Grunddaten!$F26)+O$31*LOG(Grunddaten!$H26)","v":6.5035198008949102},{"$f":"P$28+P$29*LOG(Grunddaten!$G26)+P$30*LOG(Grunddaten!$F26)+P$31*LOG(Grunddaten!$H26)","v":6.1699175055398552},{"$f":"Q$28+Q$29*LOG(Grunddaten!$G26)+Q$30*LOG(Grunddaten!$F26)+Q$31*LOG(Grunddaten!$H26)","v":7.7062204859615342},{"$f":"R$28+R$29*LOG(Grunddaten!$G26)+R$30*LOG(Grunddaten!$F26)+R$31*LOG(Grunddaten!$H26)","v":8.6789546343698909},{"$f":"S$28+S$29*LOG(Grunddaten!$G26)+S$30*LOG(Grunddaten!$F26)+S$31*LOG(Grunddaten!$H26)","v":11.346542566282894},{"$f":"T$28+T$29*LOG(Grunddaten!$G26)+T$30*LOG(Grunddaten!$F26)+T$31*LOG(Grunddaten!$H26)","v":14.756259645440647},{"$f":"U$28+U$29*LOG(Grunddaten!$G26)+U$30*LOG(Grunddaten!$F26)+U$31*LOG(Grunddaten!$H26)","v":16.403917144378521},{"$f":"V$28+V$29*LOG(Grunddaten!$G26)+V$30*LOG(Grunddaten!$F26)+V$31*LOG(Grunddaten!$H26)","v":17.789198034955515},{"$f":"10*LOG(10^(0.1*B62)+10^(0.1*C62)+10^(0.1*D62)+10^(0.1*E62)+10^(0.1*F62)+10^(0.1*G62)+10^(0.1*H62)+10^(0.1*I62)+10^(0.1*J62)+10^(0.1*K62)+10^(0.1*L62)+10^(0.1*M62)+10^(0.1*N62)+10^(0.1*O62)+10^(0.1*P62)+10^(0.1*Q62)+10^(0.1*R62)+10^(0.1*S62)+10^(0.1*T62)+10^(0.1*U62)+10^(0.1*V62))","v":26.790792298986169}]
[{"$f":"Grunddaten!C27","v":"KSW-1LWABL10001"},{"$f":"B$28+B$29*LOG(Grunddaten!$G27)+B$30*LOG(Grunddaten!$F27)+B$31*LOG(Grunddaten!$H27)","v":7.2379566574493595},{"$f":"C$28+C$29*LOG(Grunddaten!$G27)+C$30*LOG(Grunddaten!$F27)+C$31*LOG(Grunddaten!$H27)","v":4.8054241930264077},{"$f":"D$28+D$29*LOG(Grunddaten!$G27)+D$30*LOG(Grunddaten!$F27)+D$31*LOG(Grunddaten!$H27)","v":7.5276843730250658},{"$f":"E$28+E$29*LOG(Grunddaten!$G27)+E$30*LOG(Grunddaten!$F27)+E$31*LOG(Grunddaten!$H27)","v":17.965334801835994},{"$f":"F$28+F$29*LOG(Grunddaten!$G27)+F$30*LOG(Grunddaten!$F27)+F$31*LOG(Grunddaten!$H27)","v":17.722866791409608},{"$f":"G$28+G$29*LOG(Grunddaten!$G27)+G$30*LOG(Grunddaten!$F27)+G$31*LOG(Grunddaten!$H27)","v":16.593997866114563},{"$f":"H$28+H$29*LOG(Grunddaten!$G27)+H$30*LOG(Grunddaten!$F27)+H$31*LOG(Grunddaten!$H27)","v":12.511609362072384},{"$f":"I$28+I$29*LOG(Grunddaten!$G27)+I$30*LOG(Grunddaten!$F27)+I$31*LOG(Grunddaten!$H27)","v":12.562162869864608},{"$f":"J$28+J$29*LOG(Grunddaten!$G27)+J$30*LOG(Grunddaten!$F27)+J$31*LOG(Grunddaten!$H27)","v":13.810644561558837},{"$f":"K$28+K$29*LOG(Grunddaten!$G27)+K$30*LOG(Grunddaten!$F27)+K$31*LOG(Grunddaten!$H27)","v":11.273369142594055},{"$f":"L$28+L$29*LOG(Grunddaten!$G27)+L$30*LOG(Grunddaten!$F27)+L$31*LOG(Grunddaten!$H27)","v":7.5105063038812023},{"$f":"M$28+M$29*LOG(Grunddaten!$G27)+M$30*LOG(Grunddaten!$F27)+M$31*LOG(Grunddaten!$H27)","v":4.512356956794072},{"$f":"N$28+N$29*LOG(Grunddaten!$G27)+N$30*LOG(Grunddaten!$F27)+N$31*LOG(Grunddaten!$H27)","v":3.6573001096437032},{"$f":"O$28+O$29*LOG(Grunddaten!$G27)+O$30*LOG(Grunddaten!$F27)+O$31*LOG(Grunddaten!$H27)","v":3.5782706188541944},{"$f":"P$28+P$29*LOG(Grunddaten!$G27)+P$30*LOG(Grunddaten!$F27)+P$31*LOG(Grunddaten!$H27)","v":4.4986393640599118},{"$f":"Q$28+Q$29*LOG(Grunddaten!$G27)+Q$30*LOG(Grunddaten!$F27)+Q$31*LOG(Grunddaten!$H27)","v":6.9345604852795972},{"$f":"R$28+R$29*LOG(Grunddaten!$G27)+R$30*LOG(Grunddaten!$F27)+R$31*LOG(Grunddaten!$H27)","v":8.0298908479136237},{"$f":"S$28+S$29*LOG(Grunddaten!$G27)+S$30*LOG(Grunddaten!$F27)+S$31*LOG(Grunddaten!$H27)","v":10.851950219944534},{"$f":"T$28+T$29*LOG(Grunddaten!$G27)+T$30*LOG(Grunddaten!$F27)+T$31*LOG(Grunddaten!$H27)","v":14.360938033262347},{"$f":"U$28+U$29*LOG(Grunddaten!$G27)+U$30*LOG(Grunddaten!$F27)+U$31*LOG(Grunddaten!$H27)","v":16.109490252893753},{"$f":"V$28+V$29*LOG(Grunddaten!$G27)+V$30*LOG(Grunddaten!$F27)+V$31*LOG(Grunddaten!$H27)","v":17.56447181975053},26.224971407952072]
[{"$f":"Grunddaten!C28","v":"KSW-1LWABL12001"},{"$f":"B$28+B$29*LOG(Grunddaten!$G28)+B$30*LOG(Grunddaten!$F28)+B$31*LOG(Grunddaten!$H28)","v":10.522739305624699},{"$f":"C$28+C$29*LOG(Grunddaten!$G28)+C$30*LOG(Grunddaten!$F28)+C$31*LOG(Grunddaten!$H28)","v":9.5941333531426594},{"$f":"D$28+D$29*LOG(Grunddaten!$G28)+D$30*LOG(Grunddaten!$F28)+D$31*LOG(Grunddaten!$H28)","v":5.9007051522922493},{"$f":"E$28+E$29*LOG(Grunddaten!$G28)+E$30*LOG(Grunddaten!$F28)+E$31*LOG(Grunddaten!$H28)","v":15.330209402919438},{"$f":"F$28+F$29*LOG(Grunddaten!$G28)+F$30*LOG(Grunddaten!$F28)+F$31*LOG(Grunddaten!$H28)","v":15.578248195125429},{"$f":"G$28+G$29*LOG(Grunddaten!$G28)+G$30*LOG(Grunddaten!$F28)+G$31*LOG(Grunddaten!$H28)","v":13.796022233356807},{"$f":"H$28+H$29*LOG(Grunddaten!$G28)+H$30*LOG(Grunddaten!$F28)+H$31*LOG(Grunddaten!$H28)","v":9.7650555309955713},{"$f":"I$28+I$29*LOG(Grunddaten!$G28)+I$30*LOG(Grunddaten!$F28)+I$31*LOG(Grunddaten!$H28)","v":9.5511224134994634},{"$f":"J$28+J$29*LOG(Grunddaten!$G28)+J$30*LOG(Grunddaten!$F28)+J$31*LOG(Grunddaten!$H28)","v":9.7335161301861657},{"$f":"K$28+K$29*LOG(Grunddaten!$G28)+K$30*LOG(Grunddaten!$F28)+K$31*LOG(Grunddaten!$H28)","v":7.6647708629025608},{"$f":"L$28+L$29*LOG(Grunddaten!$G28)+L$30*LOG(Grunddaten!$F28)+L$31*LOG(Grunddaten!$H28)","v":2.7400058042732871},{"$f":"M$28+M$29*LOG(Grunddaten!$G28)+M$30*LOG(Grunddaten!$F28)+M$31*LOG(Grunddaten!$H28)","v":-1.2646237984814661},{"$f":"N$28+N$29*LOG(Grunddaten!$G28)+N$30*LOG(Grunddaten!$F28)+N$31*LOG(Grunddaten!$H28)","v":-1.7418113791515282},{"$f":"O$28+O$29*LOG(Grunddaten!$G28)+O$30*LOG(Grunddaten!$F28)+O$31*LOG(Grunddaten!$H28)","v":-1.3307990494468731},{"$f":"P$28+P$29*LOG(Grunddaten!$G28)+P$30*LOG(Grunddaten!$F28)+P$31*LOG(Grunddaten!$H28)","v":-0.20123651715848823},{"$f":"Q$28+Q$29*LOG(Grunddaten!$G28)+Q$30*LOG(Grunddaten!$F28)+Q$31*LOG(Grunddaten!$H28)","v":1.2029441504068661},{"$f":"R$28+R$29*LOG(Grunddaten!$G28)+R$30*LOG(Grunddaten!$F28)+R$31*LOG(Grunddaten!$H28)","v":4.5714524834743795},{"$f":"S$28+S$29*LOG(Grunddaten!$G28)+S$30*LOG(Grunddaten!$F28)+S$31*LOG(Grunddaten!$H28)","v":9.6406957695492945},{"$f":"T$28+T$29*LOG(Grunddaten!$G28)+T$30*LOG(Grunddaten!$F28)+T$31*LOG(Grunddaten!$H28)","v":14.658726614893574},{"$f":"U$28+U$29*LOG(Grunddaten!$G28)+U$30*LOG(Grunddaten!$F28)+U$31*LOG(Grunddaten!$H28)","v":16.660905761035814},{"$f":"V$28+V$29*LOG(Grunddaten!$G28)+V$30*LOG(Grunddaten!$F28)+V$31*LOG(Grunddaten!$H28)","v":18.306122314955498},24.967873802396387]
[{"$f":"Grunddaten!C29","v":"KSW-1LWABL8002"},{"$f":"B$32+B$33*LOG(Grunddaten!$G29)+B$34*LOG(Grunddaten!$F29)+B$35*LOG(Grunddaten!$H29)","v":7.5611988812430386},{"$f":"C$32+C$33*LOG(Grunddaten!$G29)+C$34*LOG(Grunddaten!$F29)+C$35*LOG(Grunddaten!$H29)","v":1.0235348774191841},{"$f":"D$32+D$33*LOG(Grunddaten!$G29)+D$34*LOG(Grunddaten!$F29)+D$35*LOG(Grunddaten!$H29)","v":2.3837634445087588},{"$f":"E$32+E$33*LOG(Grunddaten!$G29)+E$34*LOG(Grunddaten!$F29)+E$35*LOG(Grunddaten!$H29)","v":2.7070038248396742},{"$f":"F$32+F$33*LOG(Grunddaten!$G29)+F$34*LOG(Grunddaten!$F29)+F$35*LOG(Grunddaten!$H29)","v":4.01042042801447},{"$f":"G$32+G$33*LOG(Grunddaten!$G29)+G$34*LOG(Grunddaten!$F29)+G$35*LOG(Grunddaten!$H29)","v":5.1608800768394687},{"$f":"H$32+H$33*LOG(Grunddaten!$G29)+H$34*LOG(Grunddaten!$F29)+H$35*LOG(Grunddaten!$H29)","v":2.3079562054397265},{"$f":"I$32+I$33*LOG(Grunddaten!$G29)+I$34*LOG(Grunddaten!$F29)+I$35*LOG(Grunddaten!$H29)","v":1.3644257681390854},{"$f":"J$32+J$33*LOG(Grunddaten!$G29)+J$34*LOG(Grunddaten!$F29)+J$35*LOG(Grunddaten!$H29)","v":-0.47493319536269496},{"$f":"K$32+K$33*LOG(Grunddaten!$G29)+K$34*LOG(Grunddaten!$F29)+K$35*LOG(Grunddaten!$H29)","v":-2.6823138740885994},{"$f":"L$32+L$33*LOG(Grunddaten!$G29)+L$34*LOG(Grunddaten!$F29)+L$35*LOG(Grunddaten!$H29)","v":-6.9760398683990665},{"$f":"M$32+M$33*LOG(Grunddaten!$G29)+M$34*LOG(Grunddaten!$F29)+M$35*LOG(Grunddaten!$H29)","v":-9.0334297934548964},{"$f":"N$32+N$33*LOG(Grunddaten!$G29)+N$34*LOG(Grunddaten!$F29)+N$35*LOG(Grunddaten!$H29)","v":-9.0396375201046411},{"$f":"O$32+O$33*LOG(Grunddaten!$G29)+O$34*LOG(Grunddaten!$F29)+O$35*LOG(Grunddaten!$H29)","v":-6.9616734076036266},{"$f":"P$32+P$33*LOG(Grunddaten!$G29)+P$34*LOG(Grunddaten!$F29)+P$35*LOG(Grunddaten!$H29)","v":-3.5470788419277284},{"$f":"Q$32+Q$33*LOG(Grunddaten!$G29)+Q$34*LOG(Grunddaten!$F29)+Q$35*LOG(Grunddaten!$H29)","v":5.1749988394997004E-2},{"$f":"R$32+R$33*LOG(Grunddaten!$G29)+R$34*LOG(Grunddaten!$F29)+R$35*LOG(Grunddaten!$H29)","v":4.6462561916797878},{"$f":"S$32+S$33*LOG(Grunddaten!$G29)+S$34*LOG(Grunddaten!$F29)+S$35*LOG(Grunddaten!$H29)","v":11.297781957201217},{"$f":"T$32+T$33*LOG(Grunddaten!$G29)+T$34*LOG(Grunddaten!$F29)+T$35*LOG(Grunddaten!$H29)","v":15.684190591318977},{"$f":"U$32+U$33*LOG(Grunddaten!$G29)+U$34*LOG(Grunddaten!$F29)+U$35*LOG(Grunddaten!$H29)","v":17.218643174965223},{"$f":"V$32+V$33*LOG(Grunddaten!$G29)+V$34*LOG(Grunddaten!$F29)+V$35*LOG(Grunddaten!$H29)","v":18.618908194696932},23.050478558290834]
[{"$f":"Grunddaten!C30","v":"KSW-1LWABL10002"},{"$f":"B$32+B$33*LOG(Grunddaten!$G30)+B$34*LOG(Grunddaten!$F30)+B$35*LOG(Grunddaten!$H30)","v":8.2605743346666998},{"$f":"C$32+C$33*LOG(Grunddaten!$G30)+C$34*LOG(Grunddaten!$F30)+C$35*LOG(Grunddaten!$H30)","v":1.2592376385627588},{"$f":"D$32+D$33*LOG(Grunddaten!$G30)+D$34*LOG(Grunddaten!$F30)+D$35*LOG(Grunddaten!$H30)","v":-1.4560864255138455},{"$f":"E$32+E$33*LOG(Grunddaten!$G30)+E$34*LOG(Grunddaten!$F30)+E$35*LOG(Grunddaten!$H30)","v":-0.94580370733214636},{"$f":"F$32+F$33*LOG(Grunddaten!$G30)+F$34*LOG(Grunddaten!$F30)+F$35*LOG(Grunddaten!$H30)","v":3.6341480224138891},{"$f":"G$32+G$33*LOG(Grunddaten!$G30)+G$34*LOG(Grunddaten!$F30)+G$35*LOG(Grunddaten!$H30)","v":1.4520843140311399},{"$f":"H$32+H$33*LOG(Grunddaten!$G30)+H$34*LOG(Grunddaten!$F30)+H$35*LOG(Grunddaten!$H30)","v":0.46308812828638057},{"$f":"I$32+I$33*LOG(Grunddaten!$G30)+I$34*LOG(Grunddaten!$F30)+I$35*LOG(Grunddaten!$H30)","v":-3.2288708362759522},{"$f":"J$32+J$33*LOG(Grunddaten!$G30)+J$34*LOG(Grunddaten!$F30)+J$35*LOG(Grunddaten!$H30)","v":-5.2235816163098434},{"$f":"K$32+K$33*LOG(Grunddaten!$G30)+K$34*LOG(Grunddaten!$F30)+K$35*LOG(Grunddaten!$H30)","v":-8.0608488121826269},{"$f":"L$32+L$33*LOG(Grunddaten!$G30)+L$34*LOG(Grunddaten!$F30)+L$35*LOG(Grunddaten!$H30)","v":-13.238964958689508},{"$f":"M$32+M$33*LOG(Grunddaten!$G30)+M$34*LOG(Grunddaten!$F30)+M$35*LOG(Grunddaten!$H30)","v":-14.892629206857642},{"$f":"N$32+N$33*LOG(Grunddaten!$G30)+N$34*LOG(Grunddaten!$F30)+N$35*LOG(Grunddaten!$H30)","v":-14.136970626472444},{"$f":"O$32+O$33*LOG(Grunddaten!$G30)+O$34*LOG(Grunddaten!$F30)+O$35*LOG(Grunddaten!$H30)","v":-11.379713374444329},{"$f":"P$32+P$33*LOG(Grunddaten!$G30)+P$34*LOG(Grunddaten!$F30)+P$35*LOG(Grunddaten!$H30)","v":-7.2700075074451966},{"$f":"Q$32+Q$33*LOG(Grunddaten!$G30)+Q$34*LOG(Grunddaten!$F30)+Q$35*LOG(Grunddaten!$H30)","v":-3.2872121796247775},{"$f":"R$32+R$33*LOG(Grunddaten!$G30)+R$34*LOG(Grunddaten!$F30)+R$35*LOG(Grunddaten!$H30)","v":3.1573156784911074},{"$f":"S$32+S$33*LOG(Grunddaten!$G30)+S$34*LOG(Grunddaten!$F30)+S$35*LOG(Grunddaten!$H30)","v":11.457446943319692},{"$f":"T$32+T$33*LOG(Grunddaten!$G30)+T$34*LOG(Grunddaten!$F30)+T$35*LOG(Grunddaten!$H30)","v":16.668475085103079},{"$f":"U$32+U$33*LOG(Grunddaten!$G30)+U$34*LOG(Grunddaten!$F30)+U$35*LOG(Grunddaten!$H30)","v":18.592961410333562},{"$f":"V$32+V$33*LOG(Grunddaten!$G30)+V$34*LOG(Grunddaten!$F30)+V$35*LOG(Grunddaten!$H30)","v":19.850381612170736},23.93725315259011]
[{"$f":"Grunddaten!C31","v":"KSW-1LWABL12002"},{"$f":"B$32+B$33*LOG(Grunddaten!$G31)+B$34*LOG(Grunddaten!$F31)+B$35*LOG(Grunddaten!$H31)","v":7.8366460159086415},{"$f":"C$32+C$33*LOG(Grunddaten!$G31)+C$34*LOG(Grunddaten!$F31)+C$35*LOG(Grunddaten!$H31)","v":2.5788388652125462},{"$f":"D$32+D$33*LOG(Grunddaten!$G31)+D$34*LOG(Grunddaten!$F31)+D$35*LOG(Grunddaten!$H31)","v":-2.5034930053667637},{"$f":"E$32+E$33*LOG(Grunddaten!$G31)+E$34*LOG(Grunddaten!$F31)+E$35*LOG(Grunddaten!$H31)","v":1.609571394109409},{"$f":"F$32+F$33*LOG(Grunddaten!$G31)+F$34*LOG(Grunddaten!$F31)+F$35*LOG(Grunddaten!$H31)","v":3.9565174972045867},{"$f":"G$32+G$33*LOG(Grunddaten!$G31)+G$34*LOG(Grunddaten!$F31)+G$35*LOG(Grunddaten!$H31)","v":1.6353136159141002},{"$f":"H$32+H$33*LOG(Grunddaten!$G31)+H$34*LOG(Grunddaten!$F31)+H$35*LOG(Grunddaten!$H31)","v":-1.4244241380517355},{"$f":"I$32+I$33*LOG(Grunddaten!$G31)+I$34*LOG(Grunddaten!$F31)+I$35*LOG(Grunddaten!$H31)","v":-4.4076907052641943},{"$f":"J$32+J$33*LOG(Grunddaten!$G31)+J$34*LOG(Grunddaten!$F31)+J$35*LOG(Grunddaten!$H31)","v":-6.2522586874645967},{"$f":"K$32+K$33*LOG(Grunddaten!$G31)+K$34*LOG(Grunddaten!$F31)+K$35*LOG(Grunddaten!$H31)","v":-10.394686922309944},{"$f":"L$32+L$33*LOG(Grunddaten!$G31)+L$34*LOG(Grunddaten!$F31)+L$35*LOG(Grunddaten!$H31)","v":-16.382993057745004},{"$f":"M$32+M$33*LOG(Grunddaten!$G31)+M$34*LOG(Grunddaten!$F31)+M$35*LOG(Grunddaten!$H31)","v":-17.838074728599608},{"$f":"N$32+N$33*LOG(Grunddaten!$G31)+N$34*LOG(Grunddaten!$F31)+N$35*LOG(Grunddaten!$H31)","v":-16.723110018773706},{"$f":"O$32+O$33*LOG(Grunddaten!$G31)+O$34*LOG(Grunddaten!$F31)+O$35*LOG(Grunddaten!$H31)","v":-12.723287846086826},{"$f":"P$32+P$33*LOG(Grunddaten!$G31)+P$34*LOG(Grunddaten!$F31)+P$35*LOG(Grunddaten!$H31)","v":-9.2067998432984091},{"$f":"Q$32+Q$33*LOG(Grunddaten!$G31)+Q$34*LOG(Grunddaten!$F31)+Q$35*LOG(Grunddaten!$H31)","v":-5.237808278281296},{"$f":"R$32+R$33*LOG(Grunddaten!$G31)+R$34*LOG(Grunddaten!$F31)+R$35*LOG(Grunddaten!$H31)","v":2.0319017744071886},{"$f":"S$32+S$33*LOG(Grunddaten!$G31)+S$34*LOG(Grunddaten!$F31)+S$35*LOG(Grunddaten!$H31)","v":11.391320206685997},{"$f":"T$32+T$33*LOG(Grunddaten!$G31)+T$34*LOG(Grunddaten!$F31)+T$35*LOG(Grunddaten!$H31)","v":17.405597219049017},{"$f":"U$32+U$33*LOG(Grunddaten!$G31)+U$34*LOG(Grunddaten!$F31)+U$35*LOG(Grunddaten!$H31)","v":19.196323365008805},{"$f":"V$32+V$33*LOG(Grunddaten!$G31)+V$34*LOG(Grunddaten!$F31)+V$35*LOG(Grunddaten!$H31)","v":20.578651441067869},24.526188941638871]
[]
[]
[null,"Oktav-Frequenz fOkt [Hz]",null,null,null,null,null,null,"SLWA "]
[null,125,250,500,1000,2000,4000,8000,"Summe"]
[{"$f":"A40","v":"KSWZUL5001"},{"$f":"10*LOG(10^(0.1*B40)+10^(0.1*C40)+10^(0.1*D40))","v":19.698426320936694},{"$f":"10*LOG(10^(0.1*E40)+10^(0.1*F40)+10^(0.1*G40))","v":30.895130417334258},{"$f":"10*LOG(10^(0.1*H40)+10^(0.1*I40)+10^(0.1*J40))","v":31.294569535908522},{"$f":"10*LOG(10^(0.1*K40)+10^(0.1*L40)+10^(0.1*M40))","v":31.240870432679138},{"$f":"10*LOG(10^(0.1*N40)+10^(0.1*O40)+10^(0.1*P40))","v":23.743385173837037},{"$f":"10*LOG(10^(0.1*Q40)+10^(0.1*R40)+10^(0.1*S40))","v":19.341051535873465},{"$f":"10*LOG(10^(0.1*T40)+10^(0.1*U40)+10^(0.1*V40))","v":18.470296805491909},{"$f":"10*LOG(10^(0.1*B72)+10^(0.1*C72)+10^(0.1*D72)+10^(0.1*E72)+10^(0.1*F72)+10^(0.1*G72)+10^(0.1*H72))","v":36.427800492217386}]
["KSWZUL8001",18.624860730853282,33.468932036497534,34.626000982934514,35.46165482658661,27.053738628886389,21.066432629656987,18.53307911222781,{"$f":"10*LOG(10^(0.1*B73)+10^(0.1*C73)+10^(0.1*D73)+10^(0.1*E73)+10^(0.1*F73)+10^(0.1*G73)+10^(0.1*H73))","v":39.740745565361678}]
["KSWZUL10001",17.266776869275983,28.988459975712306,28.758452329811352,28.375388745910652,20.772259183534505,18.074849438026586,18.215367325443271,34.039347775076777]
["KSWZUL12001",18.366133078310259,26.891369658574003,26.090152398151751,24.896468656100339,18.125440356129513,16.769110234002063,18.170475784689213,31.616010793891501]
["KSWZUL5002",15.768419522468102,22.181483491352783,22.304422429128174,20.005138611158849,15.121136680613663,15.789895825759944,17.883675469970736,27.817466669437461]
["KSWZUL8002",14.762440558486547,28.022306647177192,27.333262124973707,24.947239820510426,20.685233621257794,16.720274336177997,16.438433108701133,32.370002379052309]
["KSWZUL10002",15.722511113645009,22.650024150282793,22.580575771077189,20.1818018663548,15.435033236840916,15.750968497518539,17.761071352845221,28.055842762668]
["KSWZUL12002",16.226144539341462,22.183310963965845,20.973209267893104,17.719921958362981,13.734054265389348,14.794079300754017,17.8639865290736,27.045535188103216]
["KSWABL5001",17.325883581011869,32.090185876373866,32.584945033166719,32.583760799792351,25.583960966485094,23.007237069098174,18.327380111617025,37.729170629059723]
["KSWABL8001",18.791675390484379,33.514164096436801,35.3400457800605,35.224087218929178,28.760309430595314,25.054607650846656,18.475309873245337,40.091790108221474]
["KSWABL10001",17.325883581011869,32.090185876373866,32.584945033166719,32.583760799792351,25.583960966485094,23.007237069098174,18.327380111617025,37.729170629059723]
["KSWABL12001",17.117713706761627,30.948597834753468,30.206485537885548,29.722634402712124,22.788556578394626,21.063048688699265,18.209579127136287,35.642429676534576]
["KSWABL5002",13.36526479296584,23.437636136752889,23.248868211072981,18.501525684628103,14.308821645765523,15.556967369289499,17.926908362570927,28.125521163272186]
["KSWABL8002",15.049142033813919,26.670475045522291,26.854903953940482,24.441980296160754,18.770630882069796,16.906738187568344,18.064773314534264,31.607117176237544]
["KSWABL10002",13.36526479296584,23.437636136752889,23.248868211072981,18.501525684628103,14.308821645765523,15.556967369289499,17.926908362570927,28.125521163272186]
["KSWABL12002",11.941818650536371,20.233695110290938,17.77428498386335,12.584685891071171,11.292375941028814,14.550281427325418,17.958013989393468,24.823966463954953]
["KSW-1LWZUL8001",{"$f":"10*LOG(10^(0.1*B56)+10^(0.1*C56)+10^(0.1*D56))","v":11.605127282102053},{"$f":"10*LOG(10^(0.1*E56)+10^(0.1*F56)+10^(0.1*G56))","v":19.98718730651423},{"$f":"10*LOG(10^(0.1*H56)+10^(0.1*I56)+10^(0.1*J56))","v":18.809469491828811},{"$f":"10*LOG(10^(0.1*K56)+10^(0.1*L56)+10^(0.1*M56))","v":17.460095832242569},{"$f":"10*LOG(10^(0.1*N56)+10^(0.1*O56)+10^(0.1*P56))","v":11.488651503194191},{"$f":"10*LOG(10^(0.1*Q56)+10^(0.1*R56)+10^(0.1*S56))","v":13.100705853564554},{"$f":"10*LOG(10^(0.1*T56)+10^(0.1*U56)+10^(0.1*V56))","v":19.922353776509901},25.782462849240734]
["KSW-1LWZUL10001",11.115885013766395,16.411698269723715,13.965916549097368,10.035361995104655,3.369892902191665,9.7759533949546498,19.682519720671515,22.929726808938035]
["KSW-1LWZUL12001",9.2527715787496732,13.587406478742437,10.592810605936108,6.329592612210174,-2.0431447795033284,6.6637088871975791,20.59842017235253,22.228618825368454]
["KSW-1LWZUL8002",11.923419759173704,13.200008471536551,9.8419636072004231,7.7599887365881468,1.8712792597342689,10.284040871217572,20.499248427593571,22.466827706784208]
["KSW-1LWZUL10002",8.3809550467246048,9.674082840662253,6.8866769020769159,0.60508664155104963,-5.2804899720741236,9.4804112313934308,22.934871824029528,23.577873618755355]
["KSW-1LWZUL12002",4.5418054839316149,10.262791727392312,5.0091939318730763,-1.193627517597343,-7.5351922749009557,6.0317938944704066,21.067835140437026,21.745226105201763]
["KSW-1LWABL8001",12.976451827345418,21.844703666991961,19.511140643995738,16.161361593329804,11.327259486671046,14.298994189566439,21.261123490621529,26.790792298986169]
["KSW-1LWABL10001",11.454215286056819,22.238463196013459,17.775482453541045,13.398609148392692,8.7030015085594297,13.702797207739966,20.975973389591161,26.224971407952076]
["KSW-1LWABL12001",13.852123100217288,19.741141309126473,14.45546279229719,9.2775810800885967,3.7298517282223069,11.267889194204571,21.562188619440896,24.96787380239639]
["KSW-1LWABL8002",9.3953418217340676,8.844912550784791,5.9845026541536486,-0.63094100596132918,-1.1468901631467294,12.407898261612155,22.108125374753929,23.050478558290834]
["KSW-1LWABL10002",9.4206926827646988,6.5420475838062675,2.7608046321379476,-6.2684138281460786,-5.2453708436781241,12.181578835552521,23.331954500188669,23.937253152590113]
["KSW-1LWABL12002",9.26825890670926,7.3180885214740323,1.2051569331501755,-8.8351745890420368,-7.1058835172296684,11.951310053497487,24.020606157610192,24.526188941638875]
[null,2,3,4,5,6,7,8,9]
["Auswahl:",-16.100000000000001,-8.6,-3.2,0,1.2,1,-1.1000000000000001]
[{"$f":"Grunddaten!C49","v":"KSWZUL10001"},{"$f":"IF($I$102=\"<25\",\"\",VLOOKUP($A$102,$A$72:$I$99,B$100,FALSE))","v":17.266776869275983},{"$f":"IF($I$102=\"<25\",\"\",VLOOKUP($A$102,$A$72:$I$99,C$100,FALSE))","v":28.988459975712306},28.758452329811352,28.375388745910652,20.772259183534505,18.074849438026586,18.215367325443271,{"$f":"IF(VLOOKUP($A$102,$A$72:$I$99,I$100,FALSE)<25,\"<25\",VLOOKUP($A$102,$A$72:$I$99,I$100,FALSE))","v":34.039347775076777}]
[{"$f":"Grunddaten!C50","v":"KSWABL10001"},{"$f":"IF($I$103=\"<25\",\"\",VLOOKUP($A$103,$A$72:$I$99,B$100,FALSE))","v":17.325883581011869},{"$f":"IF($I$103=\"<25\",\"\",VLOOKUP($A$103,$A$72:$I$99,C$100,FALSE))","v":32.090185876373866},32.584945033166719,32.583760799792351,25.583960966485094,23.007237069098174,18.327380111617025,{"$f":"IF(VLOOKUP($A$103,$A$72:$I$99,I$100,FALSE)<25,\"<25\",VLOOKUP($A$103,$A$72:$I$99,I$100,FALSE))","v":37.729170629059723}]
[null,{"$f":"IF($I$102=\"<25\",\"\",B102-B101)","v":33.366776869275981},{"$f":"IF($I$102=\"<25\",\"\",C102-C101)","v":37.588459975712304},{"$f":"IF($I$102=\"<25\",\"\",D102-D101)","v":31.958452329811351},{"$f":"IF($I$102=\"<25\",\"\",E102-E101)","v":28.375388745910652},19.572259183534506,17.074849438026586,19.315367325443273]
[null,{"$f":"IF(B$103=\"\",\"\",B103-B101)","v":33.425883581011874},{"$f":"IF(C$103=\"\",\"\",C103-C101)","v":40.690185876373867},35.784945033166721,32.583760799792351,24.383960966485095,22.007237069098174,19.427380111617026]
[]
["T[s] nach VDI 2081",null,null,null,"Nachhallzeit","Richtungsfaktor","Raumvolumen","äqu. Absorptionsfläche"]
["Raumart",null,"s",null,"t","Q","V","A"]
["Einzelbüro",null,0.5,null,"s",null,"m³","m²Sabine"]
["Großraumbüro",null,0.5,{"$f":"Auslegung!D36","v":"Einzelbüro"},{"$f":"VLOOKUP(D110,Lw!$A$109:$C$132,3,FALSE)","v":0.5},4,{"$f":"Auslegung!D32*Auslegung!D34*Auslegung!D35","v":54},{"$f":"0.163*G110/E110","v":17.603999999999999}]
["Werkstätten",null,1.5]
["Ruheraum, Pausenraum",null,1]
["Untersuchungsraum Krankenhaus",null,2]
["Rundfunk-, Fernsehstudio",null,0.5]
["Chemielabor",null,2]
["Wasch- und WC-Raum, Umkleide",null,2]
["Schwimmbad",null,2]
["EDV-Raum",null,1.5]
["Konzertsaal",null,1.5]
["Lesesaal",null,1]
["Museum",null,1.5]
["Küche",null,1.5]
["Theater, Kino",null,1]
["Klassen- Seminarraum",null,1]
["Gaststätte",null,1]
["kein Typ",null,"x"]
["Konferenzraum",null,1]
["Hotelzimmer",null,0.5]
["Hörsaal",null,1]
["Bettenzimmer Krankenhaus",null,1]
["Verkaufsraum",null,1]
["Sporthalle",null,2]

{"sheet":"Dt","index":8,"n_rows":25,"n_cols":12,"rows_kept":25,"cut":false,"hidden":true,"merged":[]}
["Frequenzband","fm_Okt","[Hz]",63,125,250,500,1000,2000,4000,8000]
[null,null,{"$f":"Grunddaten!C4","v":"KSWZUL5001"},28.071173539098098,19.028220153326941,13.200684276299825,13.987059592608233,19.612420550027267,23.537194017763227,23.704553553564708,22.588908176366793]
[null,null,{"$f":"Grunddaten!C5","v":"KSWZUL8001"},30.266909641225361,19.465934110649755,12.029251589121145,12.153086660079097,17.754084619180006,21.637224831870924,25.398833363423989,26.784364505562905]
[null,null,{"$f":"Grunddaten!C6","v":"KSWZUL10001"},20.977177239036536,11.594937881583789,7.6860228153225307,13.498963854887293,16.334390175814093,18.956656446592874,26.873813704830049,23.755415551971154]
[null,null,{"$f":"Grunddaten!C7","v":"KSWZUL12001"},20.286402818172121,13.888576735357034,7.5342453869197072,12.458402067107571,17.493988420379495,18.067136175819812,23.645676601334486,23.457427452105804]
[null,null,{"$f":"Grunddaten!C8","v":"KSWZUL5002"},26.338998167462577,23.363878893817947,11.911179232683352,11.787309025663717,16.475704396233297,19.397700584208863,23.393032691142864,24.988420878547359]
[null,null,{"$f":"Grunddaten!C9","v":"KSWZUL8002"},30.585896235269175,17.468508664199618,9.4274312762176464,11.844791323127993,15.761363189305769,20.107025791755106,23.538314970765015,24.041955548312785]
[null,null,{"$f":"Grunddaten!C10","v":"KSWZUL10002"},19.73872147153007,11.432771592639924,6.7940632806969461,11.225348332804202,13.305853135872056,16.164088344251397,23.110330886968725,21.359622489673775]
[null,null,{"$f":"Grunddaten!C11","v":"KSWZUL12002"},19.698409857859403,15.454466612265961,7.3172431684106414,13.421185591925095,14.091426117601586,16.896810725185134,21.568095654510728,20.624634693261029]
[null,null,"KSW-1LWZUL8001",26.688379752113867,17.857670596182505,13.642709650254725,16.801317894431403,26.641082887944187,28.441437099471351,23.157827477458031,24.413509467528023]
[null,null,"KSW-1LWZUL10001",24.216119392824528,17.883346568727191,16.534243529040022,18.03859368284067,22.83433887706526,24.540249080975137,28.356231492783959,27.41735400567125]
[null,null,"KSW-1LWZUL12001",26.586931301393477,17.558938755907572,17.474165863635744,15.406717376002225,21.057493990079905,25.102077261988079,25.110134750760974,25.027137785707243,"Hinweis: Durchgangsdämpfung des 2-Schlitzers verwendet, 1-Schlitzer wurde nicht messtechnisch untersucht"]
[null,null,"KSW-1LWZUL8002",23.005712254630566,15.197822854057911,9.1723439163706804,13.359547691197166,19.824252809847909,22.175823572524422,23.949316064734262,23.355206498225964]
[null,null,"KSW-1LWZUL10002",21.556634911029402,14.302910208250022,12.170011253437146,13.647692513354926,19.595697216654219,22.627654398281869,25.628020225714057,23.722459392874594]
[null,null,"KSW-1LWZUL12002",26.586931301393477,17.558938755907572,17.474165863635744,15.406717376002225,21.057493990079905,25.102077261988079,25.110134750760974,25.027137785707243]
[null,null,"KSW-1LWABL8001",26.688379752113867,17.857670596182505,13.642709650254725,16.801317894431403,26.641082887944187,28.441437099471351,23.157827477458031,24.413509467528023]
[null,null,"KSW-1LWABL10001",24.216119392824528,17.883346568727191,16.534243529040022,18.03859368284067,22.83433887706526,24.540249080975137,28.356231492783959,27.41735400567125]
[null,null,"KSW-1LWABL12001",26.586931301393477,17.558938755907572,17.474165863635744,15.406717376002225,21.057493990079905,25.102077261988079,25.110134750760974,25.027137785707243]
[null,null,"KSW-1LWABL8002",23.005712254630566,15.197822854057911,9.1723439163706804,13.359547691197166,19.824252809847909,22.175823572524422,23.949316064734262,23.355206498225964]
[null,null,"KSW-1LWABL10002",21.556634911029402,14.302910208250022,12.170011253437146,13.647692513354926,19.595697216654219,22.627654398281869,25.628020225714057,23.722459392874594]
[null,null,"KSW-1LWABL12002",26.586931301393477,17.558938755907572,17.474165863635744,15.406717376002225,21.057493990079905,25.102077261988079,25.110134750760974,25.027137785707243]
[]
[null,null,null,2,3,4,5,6,7,8,9]
[]
[null,null,{"$f":"Grunddaten!C49","v":"KSWZUL10001"},{"$f":"VLOOKUP($C$25,$C$2:$K$21,D23,FALSE)","v":20.977177239036536},{"$f":"VLOOKUP($C$25,$C$2:$K$21,E23,FALSE)","v":11.594937881583789},7.6860228153225307,13.498963854887293,16.334390175814093,18.956656446592874,26.873813704830049,23.755415551971154]

{"sheet":"xkr._vx","index":9,"n_rows":65,"n_cols":16,"rows_kept":65,"cut":false,"hidden":true,"merged":[]}
["Geschwindigkeit im Strahl",null,null,null,null,null,null,null,null,null,null,null,"kritischer Strahlweg"]
[null,null,null,null,null,null,null,null,null,null,null,null,"Schlitzanzahl","n",1,2]
["Konstanten","K031",6.1519175685683086E-3,null,null,null,null,null,null,null,null,null,"Konstanten:","K041",1.7840971390036042E-2,7.3043071442997515E-2]
[null,"K033",0.59221223573337767,null,null,null,null,null,null,null,null,null,null,"K042",0.41137168119149808,0.59107517230985229]
[null,"K034",null,null,null,null,null,null,null,null,null,null,null,"K043",1.2872387520934141,1.0678298315985706]
[null,null,null,null,null,null,null,null,null,null,null,null,"mittlere Untertemperatur","Dt0",{"$f":"IF(Auslegung!$D$30-Auslegung!$D$29>0,Auslegung!$D$30-Auslegung!$D$29,0.0000001)","v":4}]
[null,"Lauflänge","Geschwindigkeit im Strahl horizontal","Geschwindigkeit im Strahl vertikal",null,"kritischer Strahlweg Anzeige","kritischer Strahlweg","vertikaler Strahlweg","Geschwindigkeit im Strahl","Lauflänge bis Aufenthaltsbereich Anzeige","Geschwindigkeit im Strahl","Schlitzanzahl","Zugluftrisiko","Volumenstrom spezifisch"]
[null,"L","v0","v1",null,"xkr._Anzeige","xkr.","y","v0","x+y","vx","n","DR","V°spez."]
[null,"m","m/s","m/s",null,"m","m","m","m/s","m","m/s","-","%","m³/(h·m)"]
[null,0.5,{"$f":"$C$3*Auslegung!$D$27/(Grunddaten!$F$49*0.001)*(1/xkr._vx!B10)^(xkr._vx!$C$4)","v":1.4838982990058474},{"$f":"1/B10*$I$10","v":0.68128651709218735},null,{"$f":"IF($P10<Auslegung!$D$34,$P10,\">Raumlänge\")","v":">Raumlänge"},{"$f":"IF(P10<Auslegung!D34,xkr._vx!P10,Auslegung!D34)","v":6},{"$f":"(Auslegung!$D$32-Auslegung!$D$33)/SIN(45/180*PI())","v":1.697056274847714},{"$f":"$C$3*Auslegung!$D$27/(Grunddaten!$F$49*0.001)*(1/xkr._vx!G10)^(xkr._vx!$C$4)","v":0.34064325854609367},{"$f":"IF(G10+H10<Auslegung!$D$34,G10+H10,Auslegung!$D$34+(Auslegung!$D$32-Auslegung!$D$33))","v":7.2},{"$f":"1/(H10+0.5)*I10","v":0.15504530423086449},1,{"$f":"IF(K10=\"<0,1\",(34-$M$13)*(0.1-0.05)^0.62*(0.37*0.1*$M$14+3.14),(34-$M$13)*(K10-0.05)^0.62*(0.37*K10*$M$14+3.14))","v":12.022074000646736},{"$f":"Grunddaten!$G$49*10","v":160},null,{"$f":"$O$3*$N$10^$O$5*(1/xkr._vx!$O$6^(xkr._vx!$O$4))","v":6.9338863953649978}]
[null,0.6,{"$f":"$C$3*Auslegung!$D$27/(Grunddaten!$F$49*0.001)*(1/xkr._vx!B11)^(xkr._vx!$C$4)","v":1.3320239520262738},{"$f":"1/B11*$I$10","v":0.56773876424348946},null,{"$f":"IF($P11<Auslegung!$D$34,$P11,\">Raumlänge\")","v":">Raumlänge"},{"$f":"IF(P11<Auslegung!D35,xkr._vx!P11,Auslegung!D35)","v":3},{"$f":"(Auslegung!$D$32-Auslegung!$D$33)/SIN(45/180*PI())","v":1.697056274847714},{"$f":"$C$3*Auslegung!$D$27/(Grunddaten!$F$49*0.001)*(1/xkr._vx!G11)^(xkr._vx!$C$4)","v":0.51353901678862446},{"$f":"IF(G11+H11<Auslegung!$D$34,G11+H11,Auslegung!$D$34+(Auslegung!$D$32-Auslegung!$D$33))","v":4.6970562748477143},{"$f":"1/(H11+0.5)*I11","v":0.23373958267146328},2,{"$f":"IF(K11=\"<0,1\",(34-$M$13)*(0.1-0.05)^0.62*(0.37*0.1*$M$14+3.14),(34-$M$13)*(K11-0.05)^0.62*(0.37*K11*$M$14+3.14))","v":20.058661819342714},{"$f":"Grunddaten!$G$49*10","v":160},null,{"$f":"$P$3*($N$11)^$P$5*(1/xkr._vx!$O$6^(xkr._vx!$P$4))","v":7.2667694827099032}]
[null,0.7,{"$f":"$C$3*Auslegung!$D$27/(Grunddaten!$F$49*0.001)*(1/xkr._vx!B12)^(xkr._vx!$C$4)","v":1.21580892264964},0.48663322649441954]
[null,0.8,{"$f":"$C$3*Auslegung!$D$27/(Grunddaten!$F$49*0.001)*(1/xkr._vx!B13)^(xkr._vx!$C$4)","v":1.1233673202469046},0.42580407318261709,null,null,null,null,"Vorauswahl Geschwindigkeit A-Bereich",null,{"$f":"IF(Auslegung!$D$18=2,xkr._vx!$K$11,xkr._vx!$K$10)","v":0.15504530423086449},null,{"$f":"(Auslegung!D30+Auslegung!D29)/2","v":24}]
[null,0.9,{"$f":"$C$3*Auslegung!$D$27/(Grunddaten!$F$49*0.001)*(1/xkr._vx!B14)^(xkr._vx!$C$4)","v":1.0476799581064626},{"$f":"1/B14*$I$10","v":0.37849250949565966},null,null,null,null,null,null,null,null,30]
[null,1,{"$f":"$C$3*Auslegung!$D$27/(Grunddaten!$F$49*0.001)*(1/xkr._vx!B15)^(xkr._vx!$C$4)","v":0.98430681097092942},0.34064325854609367,null,null,null,null,null,null,null,null,"TU = 30 = Mittelwert Messreihen"]
[null,1.1000000000000001,{"$f":"$C$3*Auslegung!$D$27/(Grunddaten!$F$49*0.001)*(1/xkr._vx!B16)^(xkr._vx!$C$4)","v":0.93028760734732552},0.30967568958735786]
[null,1.2,{"$f":"$C$3*Auslegung!$D$27/(Grunddaten!$F$49*0.001)*(1/xkr._vx!B17)^(xkr._vx!$C$4)","v":0.88356476264867612},0.28386938212174473]
[null,1.3,{"$f":"$C$3*Auslegung!$D$27/(Grunddaten!$F$49*0.001)*(1/xkr._vx!B18)^(xkr._vx!$C$4)","v":0.8426589596595484},0.26203327580468744]
[null,1.4,{"$f":"$C$3*Auslegung!$D$27/(Grunddaten!$F$49*0.001)*(1/xkr._vx!B19)^(xkr._vx!$C$4)","v":0.80647643049731188},{"$f":"1/B19*$I$10","v":0.24331661324720977}]
[null,1.5,{"$f":"$C$3*Auslegung!$D$27/(Grunddaten!$F$49*0.001)*(1/xkr._vx!B20)^(xkr._vx!$C$4)","v":0.7741891704824152},0.22709550569739578]
[null,1.6,{"$f":"$C$3*Auslegung!$D$27/(Grunddaten!$F$49*0.001)*(1/xkr._vx!B21)^(xkr._vx!$C$4)","v":0.74515760634134398},0.21290203659130855]
[null,1.7,{"$f":"$C$3*Auslegung!$D$27/(Grunddaten!$F$49*0.001)*(1/xkr._vx!B22)^(xkr._vx!$C$4)","v":0.71887903669665976},0.20037838738005512]
[null,1.8,{"$f":"$C$3*Auslegung!$D$27/(Grunddaten!$F$49*0.001)*(1/xkr._vx!B23)^(xkr._vx!$C$4)","v":0.69495228828877142},0.18924625474782983]
[null,1.9,{"$f":"$C$3*Auslegung!$D$27/(Grunddaten!$F$49*0.001)*(1/xkr._vx!B24)^(xkr._vx!$C$4)","v":0.67305289559224657},0.1792859255505756]
[null,2,{"$f":"$C$3*Auslegung!$D$27/(Grunddaten!$F$49*0.001)*(1/xkr._vx!B25)^(xkr._vx!$C$4)","v":0.65291529667016834},0.17032162927304684]
[null,2.1,{"$f":"$C$3*Auslegung!$D$27/(Grunddaten!$F$49*0.001)*(1/xkr._vx!B26)^(xkr._vx!$C$4)","v":0.63431981957379036},0.16221107549813985]
[null,2.2000000000000002,{"$f":"$C$3*Auslegung!$D$27/(Grunddaten!$F$49*0.001)*(1/xkr._vx!B27)^(xkr._vx!$C$4)","v":0.6170830094537455},0.15483784479367893]
[null,2.2999999999999998,{"$f":"$C$3*Auslegung!$D$27/(Grunddaten!$F$49*0.001)*(1/xkr._vx!B28)^(xkr._vx!$C$4)","v":0.60105032974430972},0.14810576458525812]
[null,2.4,{"$f":"$C$3*Auslegung!$D$27/(Grunddaten!$F$49*0.001)*(1/xkr._vx!B29)^(xkr._vx!$C$4)","v":0.58609057938247389},0.14193469106087236]
[null,2.5,{"$f":"$C$3*Auslegung!$D$27/(Grunddaten!$F$49*0.001)*(1/xkr._vx!B30)^(xkr._vx!$C$4)","v":0.5720915696197213},0.13625730341843748]
[null,2.6,{"$f":"$C$3*Auslegung!$D$27/(Grunddaten!$F$49*0.001)*(1/xkr._vx!B31)^(xkr._vx!$C$4)","v":0.55895673839255655},0.13101663790234372]
[null,2.7,{"$f":"$C$3*Auslegung!$D$27/(Grunddaten!$F$49*0.001)*(1/xkr._vx!B32)^(xkr._vx!$C$4)","v":0.54660247150421293},0.12616416983188655]
[null,2.8,{"$f":"$C$3*Auslegung!$D$27/(Grunddaten!$F$49*0.001)*(1/xkr._vx!B33)^(xkr._vx!$C$4)","v":0.53495596292404624},0.12165830662360488]
[null,2.9,{"$f":"$C$3*Auslegung!$D$27/(Grunddaten!$F$49*0.001)*(1/xkr._vx!B34)^(xkr._vx!$C$4)","v":0.52395349074228403},0.11746319260210128]
[null,3,{"$f":"$C$3*Auslegung!$D$27/(Grunddaten!$F$49*0.001)*(1/xkr._vx!B35)^(xkr._vx!$C$4)","v":0.51353901678862446},0.11354775284869789]
[null,3.1,{"$f":"$C$3*Auslegung!$D$27/(Grunddaten!$F$49*0.001)*(1/xkr._vx!B36)^(xkr._vx!$C$4)","v":0.50366304061001077},0.10988492211164312]
[null,3.2,{"$f":"$C$3*Auslegung!$D$27/(Grunddaten!$F$49*0.001)*(1/xkr._vx!B37)^(xkr._vx!$C$4)","v":0.49428165505679927},0.10645101829565427]
[null,3.3,{"$f":"$C$3*Auslegung!$D$27/(Grunddaten!$F$49*0.001)*(1/xkr._vx!B38)^(xkr._vx!$C$4)","v":0.4853557629419849},0.10322522986245262]
[null,3.4,{"$f":"$C$3*Auslegung!$D$27/(Grunddaten!$F$49*0.001)*(1/xkr._vx!B39)^(xkr._vx!$C$4)","v":0.47685042334694028},0.10018919369002756]
[null,3.5,{"$f":"$C$3*Auslegung!$D$27/(Grunddaten!$F$49*0.001)*(1/xkr._vx!B40)^(xkr._vx!$C$4)","v":0.468734303006},9.7326645298883907E-2]
[null,3.6,{"$f":"$C$3*Auslegung!$D$27/(Grunddaten!$F$49*0.001)*(1/xkr._vx!B41)^(xkr._vx!$C$4)","v":0.46097921341425779},9.4623127373914914E-2]
[null,3.7,{"$f":"$C$3*Auslegung!$D$27/(Grunddaten!$F$49*0.001)*(1/xkr._vx!B42)^(xkr._vx!$C$4)","v":0.45355971829759417},9.2065745552998277E-2]
[null,3.8,{"$f":"$C$3*Auslegung!$D$27/(Grunddaten!$F$49*0.001)*(1/xkr._vx!B43)^(xkr._vx!$C$4)","v":0.44645279917026415},8.9642962775287799E-2]
[null,3.9,{"$f":"$C$3*Auslegung!$D$27/(Grunddaten!$F$49*0.001)*(1/xkr._vx!B44)^(xkr._vx!$C$4)","v":0.43963756910798241},8.7344425268229164E-2]
[null,4,{"$f":"$C$3*Auslegung!$D$27/(Grunddaten!$F$49*0.001)*(1/xkr._vx!B45)^(xkr._vx!$C$4)","v":0.43309502674820383},8.5160814636523419E-2]
[null,4.0999999999999996,{"$f":"$C$3*Auslegung!$D$27/(Grunddaten!$F$49*0.001)*(1/xkr._vx!B46)^(xkr._vx!$C$4)","v":0.42680784401621652},8.308372159660822E-2]
[null,4.2,{"$f":"$C$3*Auslegung!$D$27/(Grunddaten!$F$49*0.001)*(1/xkr._vx!B47)^(xkr._vx!$C$4)","v":0.42076018225685197},8.1105537749069923E-2]
[null,4.3,{"$f":"$C$3*Auslegung!$D$27/(Grunddaten!$F$49*0.001)*(1/xkr._vx!B48)^(xkr._vx!$C$4)","v":0.41493753239560854},7.9219362452579919E-2]
[null,4.4000000000000004,{"$f":"$C$3*Auslegung!$D$27/(Grunddaten!$F$49*0.001)*(1/xkr._vx!B49)^(xkr._vx!$C$4)","v":0.40932657551174034},7.7418922396839465E-2]
[null,4.5,{"$f":"$C$3*Auslegung!$D$27/(Grunddaten!$F$49*0.001)*(1/xkr._vx!B50)^(xkr._vx!$C$4)","v":0.40391506081906237},7.5698501899131923E-2]
[null,4.5999999999999996,{"$f":"$C$3*Auslegung!$D$27/(Grunddaten!$F$49*0.001)*(1/xkr._vx!B51)^(xkr._vx!$C$4)","v":0.39869169854834885},7.405288229262906E-2]
[null,4.7,{"$f":"$C$3*Auslegung!$D$27/(Grunddaten!$F$49*0.001)*(1/xkr._vx!B52)^(xkr._vx!$C$4)","v":0.393646065631858},7.2477289052360352E-2]
[null,4.8,{"$f":"$C$3*Auslegung!$D$27/(Grunddaten!$F$49*0.001)*(1/xkr._vx!B53)^(xkr._vx!$C$4)","v":0.3887685224240518},7.0967345530436182E-2]
[null,4.9000000000000004,{"$f":"$C$3*Auslegung!$D$27/(Grunddaten!$F$49*0.001)*(1/xkr._vx!B54)^(xkr._vx!$C$4)","v":0.38405013896738016},6.9519032356345642E-2]
[null,5,{"$f":"$C$3*Auslegung!$D$27/(Grunddaten!$F$49*0.001)*(1/xkr._vx!B55)^(xkr._vx!$C$4)","v":0.37948262953937273},6.8128651709218738E-2]
[null,5.0999999999999996,{"$f":"$C$3*Auslegung!$D$27/(Grunddaten!$F$49*0.001)*(1/xkr._vx!B56)^(xkr._vx!$C$4)","v":0.37505829440619337},6.6792795793351706E-2]
[null,5.2,{"$f":"$C$3*Auslegung!$D$27/(Grunddaten!$F$49*0.001)*(1/xkr._vx!B57)^(xkr._vx!$C$4)","v":0.37076996786537952},6.5508318951171859E-2]
[null,5.3,{"$f":"$C$3*Auslegung!$D$27/(Grunddaten!$F$49*0.001)*(1/xkr._vx!B58)^(xkr._vx!$C$4)","v":0.3666109717924097},6.4272312933225231E-2]
[null,5.4,{"$f":"$C$3*Auslegung!$D$27/(Grunddaten!$F$49*0.001)*(1/xkr._vx!B59)^(xkr._vx!$C$4)","v":0.362575074016592},6.3082084915943276E-2]
[null,5.5,{"$f":"$C$3*Auslegung!$D$27/(Grunddaten!$F$49*0.001)*(1/xkr._vx!B60)^(xkr._vx!$C$4)","v":0.35865645094523374},6.1935137917471579E-2]
[null,5.6,{"$f":"$C$3*Auslegung!$D$27/(Grunddaten!$F$49*0.001)*(1/xkr._vx!B61)^(xkr._vx!$C$4)","v":0.35484965393411755},6.0829153311802442E-2]
[null,5.7,{"$f":"$C$3*Auslegung!$D$27/(Grunddaten!$F$49*0.001)*(1/xkr._vx!B62)^(xkr._vx!$C$4)","v":0.35114957896942478},5.9761975183525204E-2]
[null,5.8,{"$f":"$C$3*Auslegung!$D$27/(Grunddaten!$F$49*0.001)*(1/xkr._vx!B63)^(xkr._vx!$C$4)","v":0.34755143928336807},5.873159630105064E-2]
[null,5.8999999999999897,{"$f":"$C$3*Auslegung!$D$27/(Grunddaten!$F$49*0.001)*(1/xkr._vx!B64)^(xkr._vx!$C$4)","v":0.34405074057458324},5.7736145516287168E-2]
[null,6,{"$f":"$C$3*Auslegung!$D$27/(Grunddaten!$F$49*0.001)*(1/xkr._vx!B65)^(xkr._vx!$C$4)","v":0.34064325854609367},5.6773876424348946E-2]

{"sheet":"Eingabe","index":10,"n_rows":50,"n_cols":20,"rows_kept":50,"cut":false,"hidden":true,"merged":[]}
[]
[null,null,null,null,1,"= Produktgruppe emcoair"]
[null,null,null,null,null,"KSW","Artikel"]
[null,null,null,null,null,null,1,"Schlitzanzahl","1 Schlitz "]
[null,null,null,null,null,null,2,null,"2 Schlitze"]
[null,null,null,null,null,null,"X",null,"Sonder"]
[null,null,null,null,null,null,null,"K","Funktion","Zuluft / Abluft Kombination"]
[null,null,null,null,null,null,null,"Z",null,"Zuluft"]
[null,null,null,null,null,null,null,"A",null,"Abluft"]
[null,null,null,null,null,null,null,null,"0500","Breite"]
[null,null,null,null,null,null,null,null,"0600"]
[null,null,null,null,null,null,null,null,"0700"]
[null,null,null,null,null,null,null,null,"0800"]
[null,null,null,null,null,null,null,null,"0900"]
[null,null,null,null,null,null,null,null,"1000"]
[null,null,null,null,null,null,null,null,"1100"]
[null,null,null,null,null,null,null,null,"1200"]
[null,null,null,null,null,null,null,null,null,"A","Werkstoff","Aluminium"]
[]
[]
[null,null,null,null,null,null,null,null,null,null,9010,"Oberfläche Luftdurchlass","RAL 9010 glänzend"]
[null,null,null,null,null,null,null,null,null,null,"E6C0",null,"Aluminium naturfarbig eloxiert"]
[null,null,null,null,null,null,null,null,null,null,"XXXX",null,"RAL-Ton **** glänzend"]
[null,null,null,null,null,null,null,null,null,null,"SSSS",null,"Sonderlackierung"]
[null,null,null,null,null,null,null,null,null,null,null,"S","Farbe Luftlenkelement","schwarz"]
[null,null,null,null,null,null,null,null,null,null,null,"W",null,"weiß"]
[null,null,null,null,null,null,null,null,null,null,null,"G",null,"grau"]
[null,null,null,null,null,null,null,null,null,null,null,null,"C","Luftlenkeinstellung","DE"]
[null,null,null,null,null,null,null,null,null,null,null,null,"S",null,"Sonder"]
[null,null,null,null,null,null,null,null,null,null,null,null,null,"V","Werkstoff Anschlusskasten","Stahl verzinkt"]
[null,null,null,null,null,null,null,null,null,null,null,null,null,0,null,"ohne Anschlusskasten"]
[null,null,null,null,null,null,null,null,null,null,null,null,null,null,1,"Drossel ","mit FBD"]
[null,null,null,null,null,null,null,null,null,null,null,null,null,null,0,null,"ohne FBD"]
[null,null,null,null,null,null,null,null,null,null,null,null,null,null,null,"B1","Innenauskleidung","Dämmung Baustoffklasse B1"]
[null,null,null,null,null,null,null,null,null,null,null,null,null,null,null,"A2",null,"Dämmung Baustoffklasse A2"]
[null,null,null,null,null,null,null,null,null,null,null,null,null,null,null,null,1,"Stutzenanzahl","1 Stutzen"]
[null,null,null,null,null,null,null,null,null,null,null,null,null,null,null,null,"x",null,"Sonder"]
[null,null,null,null,null,null,null,null,null,null,null,null,null,null,null,null,null,100,"Stutzendurchmesser","98 mm"]
[null,null,null,null,null,null,null,null,null,null,null,null,null,null,null,null,null,"080",null,"78 mm"]
[null,null,null,null,null,null,null,null,null,null,null,null,null,null,null,null,null,"xxx",null,"Sonder"]
[null,null,null,null,{"$f":"E2","v":1},{"$f":"F3","v":"KSW"},{"$f":"G4","v":1},1,{"$f":"I10","v":"0500"},{"$f":"J18","v":"A"},{"$f":"K21","v":9010},{"$f":"L25","v":"S"},{"$f":"M28","v":"C"},{"$f":"N30","v":"V"},{"$f":"O32","v":1},{"$f":"P34","v":"B1"},{"$f":"Q36","v":1},{"$f":"R38","v":100}]
[]
[]
[]
["Schwarz","S"]
["weiß","W"]
["naturfarbig eloxiert","K"]
["weiß (RAL 9010) bepulvert","L"]
["Anschlusskasten ohne Mengeneinstellung","AK1"]
["Anschlusskasten mit Mengeneinstellung*","AK2"]