{"text_format":"1","workbook":"xlsx","n_sheets":17,"sheets":["Version","Vorgaben","Hinweise zum Programm","Auslegung","Funktion","Maße","Datenblatt","Grunddaten","Lw","DR","xkr._vx","Eingabe","DAL359-CAP","DAL358-CAP","DRS-CAP","DIA-CAP","MSA-CAP"],"not_rendered":{"charts":0,"images":19,"macros":1,"external_links":0,"defined_names":2,"comments":3,"pivot_tables":0},"unopened":[],"bounds":{"document_bytes":16777216,"sheet_cells":100000,"rows_first":2000,"rows_last":500,"rows_between":2000,"halvings":0,"cell_chars":16384,"cell_head_chars":4096},"cells_cut":0,"cells_raw":0,"read":"whole","date_system":"1900"}

{"sheet":"Version","index":0,"n_rows":2,"n_cols":2,"rows_kept":2,"cut":false,"hidden":true,"merged":[]}
["Service",{"$f":"MID(CELL(\"dateiname\"),FIND(\"[\",CELL(\"dateiname\"))+1,FIND(\"]\",CELL(\"dateiname\"))-FIND(\"[\",CELL(\"dateiname\"))-1)","v":"650_Auslegungstool_Draller_201030.xlsm"}]
["Version:","1.0"]

{"sheet":"Vorgaben","index":1,"n_rows":99,"n_cols":11,"rows_kept":99,"cut":false,"hidden":false,"merged":[[96,4,96,5],[97,4,97,5],[98,4,98,5],[0,0,0,3],[5,0,5,3],[53,1,53,3],[54,1,54,3],[58,1,58,3],[59,1,59,3],[12,0,12,3],[67,1,67,3],[71,1,71,3],[62,1,62,3],[64,1,64,3],[20,0,20,3],[95,4,95,5],[48,0,48,3],[78,0,88,2],[92,4,92,5],[93,4,93,5],[94,4,94,5],[49,1,49,3]]}
["Auslegung Kampmann Drallluftdurchlässe"]
[]
["Eingabefelder sind gelb gekennzeichnet"]
["Ergebnisfelder sind blau gekennzeichnet"]
[]
["Vorgaben"]
["Lüftungstechnik und Akustik","Symbol","Einheit","Wert"]
["Gesamtvolumenstrom","V·SUP","m³/h",550]
["Anzahl Luftdurchlässe (nur Zuluft)","n",1,1]
["Temperatur Zuluft","tSUP","°C",16]
["Temperatur Raum","tRaum","°C",26]
["Maximaler Einzel-Schallleistungspegel","LW,Amax","dB(A)",35]
["Raumdaten"]
["Raumhöhe","H1","m",3.05]
["Obergrenze Aufenthaltsbereich","H2","m",1.83]
["Raumlänge","LR","m",7.4]
["Raumbreite","BR","m",5.6]
["Abstand Durchlass zur nächstgelegenen Wand","a","m",3]
["kleinster Abstand zwischen 2 Durchlässen","smin","m",5]
[]
["Akustikdaten"]
["Raumart nach VDI 2081",null,null,"Großraumbüro"]
[null,null,"Einzelbüro",null,null,null,null,5,"min. Abmessung Frontblende rund",{"$f":"Grunddaten!Q33","v":800},"mm"]
[null,null,"Großraumbüro"]
[null,null,"Werkstätten"]
[null,null,"Ruheraum, Pausenraum"]
[null,null,"Untersuchungsraum Krankenhaus"]
[null,null,"Rundfunk-, Fernsehstudio"]
[null,null,"Chemielabor"]
[null,null,"Wasch- und WC-Raum, Umkleide"]
[null,null,"Schwimmbad"]
[null,null,"EDV-Raum"]
[null,null,"Konzertsaal"]
[null,null,"Lesesaal"]
[null,null,"Museum"]
[null,null,"Küche"]
[null,null,"Theater, Kino"]
[null,null,"Klassen- Seminarraum"]
[null,null,"Gaststätte"]
[null,null,"kein Typ"]
[null,null,"Konferenzraum"]
[null,null,"Hotelzimmer"]
[null,null,"Hörsaal"]
[null,null,"Bettenzimmer Krankenhaus"]
[null,null,"Verkaufsraum"]
[null,"","Sporthalle"]
["Maximaler Schallleistungspegel",null,null,"Zuluft"]
["Abstand zur Schallquelle","r","m",3]
["Zusatzdaten"]
["Funktion","",null,null,{"$f":"VLOOKUP(B50,Eingabe!$A$45:$B$48,2,FALSE)","v":{"$error":"#N/A"}},{"$f":"VLOOKUP($B$50,$B$51:$F$53,6,0)","v":{"$error":"#N/A"}}]
[null,{"$f":"IF(#REF!=500,\"Zuluft\",\"\")","v":{"$error":"#REF!"}},null,null,null,"Z"]
[null,{"$f":"IF(#REF!=500,\"Abluft\",\"\")","v":{"$error":"#REF!"}},null,null,null,"A"]
[null,{"$f":"IF(#REF!>500,\"Zuluft/Abluft-Kombination\",\"\")","v":{"$error":"#REF!"}},null,null,null,"K"]
["Farbe Abdeckprofil und Endwinkel",9010,null,null,{"$f":"VLOOKUP(B54,Eingabe!A45:B48,2,FALSE)","v":{"$error":"#N/A"}},{"$f":"$B$54","v":9010}]
["Farbe Luftlenkelement","schwarz",null,null,null,{"$f":"VLOOKUP(B55,B56:F58,6,FALSE)","v":{"$error":"#REF!"}}]
[null,"schwarz",null,null,null,"S"]
[null,"weiß",null,null,null,"W"]
[null,"grau",null,null,null,"G"]
["Einstellung Luftlenkelement",null,null,null,null,{"$f":"VLOOKUP(B59,B60:F63,6,FALSE)","v":{"$error":"#N/A"}}]
[null,"Deckenstrahl D / E",null,null,null,"D"]
[null,"Sondereinstellung",null,null,null,"S"]
[]
["Werkstoff Anschlusskasten","Stahl verzinkt",null,null,null,"V"]
[null,"Stahl verzinkt"]
["frontseitig bedienbare Drossel","ohne",null,null,{"$f":"VLOOKUP(B65,Eingabe!$A$45:$B$51,2,FALSE)","v":{"$error":"#N/A"}},{"$f":"VLOOKUP(B65,B66:F68,6,FALSE)","v":{"$error":"#REF!"}}]
[null,"mit",null,null,null,1]
[null,"ohne",null,null,null,0]
["Innenauskleidung","Baustoffklasse B1 (Standard)",null,null,null,{"$f":"VLOOKUP(B68,B69:F72,6,FALSE)","v":{"$error":"#REF!"}}]
[null,"Baustoffklasse B1 (Standard)",null,null,null,"B1"]
[null,"Baustoffklasse A2 (optional)",null,null,null,"A2"]
[]
["Merkmalschlüssel",{"$f":"CONCATENATE(1,\"KSW\",\"0\",#REF!,F72,F50,\"A\",F54,F55,F59,F63,F65,F68,1,F73)","v":{"$error":"#REF!"}},null,null,null,{"$f":"IF(#REF!<1000,CONCATENATE(0,#REF!),#REF!)","v":{"$error":"#REF!"}}]
["Informationen zu den Vorgaben",null,null,null,null,{"$f":"IF(J18=78,\"080\",100)","v":100}]
["Raumvolumen","VR","m³",{"$f":"$D$14*$D$16*$D$17","v":126.392}]
["Luftwechselzahl","W",1,{"$f":"$D$8/$D$74","v":4.3515412367871384}]
["Kühlleistung","Q°K","W",{"$f":"$D$8*1.2*1.006*($D$11-$D$10)/3.6","v":1844.3333333333335}]
[]
[]
["Verfügbare Luftdurchlässe, Treffen Sie Ihre Auswahl!",null,null,{"$f":"Grunddaten!AC4","v":"DAL 359 DN 600"}]
[null,null,null,{"$f":"Grunddaten!AC5","v":"DAL 358 DN 800"}]
[null,null,null,{"$f":"Grunddaten!AC6","v":"DRS DN 315"}]
[null,null,null,{"$f":"Grunddaten!AC7","v":"DRS DN 355"}]
[null,null,null,{"$f":"Grunddaten!AC8","v":"MSA DN 600"}]
[null,null,null,{"$f":"Grunddaten!AC9","v":""}]
[null,null,null,{"$f":"Grunddaten!AC10","v":""}]
[null,null,null,{"$f":"Grunddaten!AC11","v":""}]
[null,null,null,{"$f":"Grunddaten!AC12","v":""}]
[null,null,null,{"$f":"Grunddaten!AC13","v":""}]
[null,null,null,{"$f":"Grunddaten!AC14","v":""}]
[null,null,null,{"$f":"Grunddaten!AC15","v":""}]
["Änderungen vorbehalten",null,null,{"$f":"Grunddaten!AC16","v":""}]
["Stand:",{"$f":"Grunddaten!E36","v":"2020-10-30"},null,{"$f":"Grunddaten!AC17","v":""}]
[{"$f":"Grunddaten!E36","v":"2020-10-30"},null,null,{"$f":"Grunddaten!AC18","v":""},{"$f":"Grunddaten!AE18","v":0}]
[null,null,null,{"$f":"Grunddaten!AC19","v":""},{"$f":"Grunddaten!AE19","v":0}]
[null,null,null,null,{"$f":"Grunddaten!AE20","v":0}]
[null,null,null,null,{"$f":"Grunddaten!AE21","v":0}]
[null,null,null,null,{"$f":"Grunddaten!AE22","v":0}]
[null,null,null,null,{"$f":"Grunddaten!AE23","v":0}]
[null,null,null,null,{"$f":"Grunddaten!AE24","v":0}]

{"sheet":"Hinweise zum Programm","index":2,"n_rows":22,"n_cols":1,"rows_kept":22,"cut":false,"hidden":true,"merged":[]}
["Hinweise zur Bedienung"]
[]
["Allgemeine Hinweise:"]
["Das Auslegungstool Draller dient als Hilfsmittel zur Technischen Planung des emcoair KSW. "]
[]
["Auslegung:"]
["Im Tabellenblatt \"Auslegung\" erfolgt die Festlegung des gewünschten Auslasstyps. Bei Eingabe der Vorgabedaten, wie z.B. dem benötigten Luftvolumenstrom werden die technischen Daten des gewählten Luftdurchlasses berechnet."]
[]
["Strömungsformen:"]
["Die im Tabellenblatt \"Auslegung\" ermittelten Strömungsgeschwindigkeiten gelten für einen deckenbündig montierten Luftdurchlass mit horizontaler Ausblascharakteristik. "]
[]
["Funktion:"]
["Im Tabellenblatt \"Funktion\" finden Sie eine kurze Funktionsbeschreibung zum emcoair KSW."]
[]
["Maße:"]
["Das Tabellenblatt \"Maße\" gibt einen Überblick über die wählbare Größen und Varianten des emcoair KSW mit detaillierten Bemaßungen."]
[]
["Hinweise zur Funktion:"]
["Für eine ordnungsgemäße Funktion des Auslegungstools muss die Ausführung von Makros und MS Excel aktiviert sein. Die Aktivierung von Makros erfolgt im Menü Makrosicherheit."]
["Einstellung unter MS Excel 97-2003: Extras → Makro → Sicherheit"]
["Einstellung unter MS Excel 2007: Entwicklertools* → Makrosicherheit  "]
["*Das Menü Entwicklertools muss unter Umständen eingefügt werden unter Excel-Optionen"]

{"sheet":"Auslegung","index":3,"n_rows":131,"n_cols":12,"rows_kept":131,"cut":false,"hidden":false,"merged":[[13,3,13,4],[14,3,14,4],[15,3,15,4],[18,3,18,4],[19,3,19,4],[115,3,115,4],[43,0,43,4],[114,3,114,4],[100,4,110,4],[39,3,39,4],[69,3,69,4],[72,3,72,4],[79,1,79,4],[78,1,78,4],[40,3,40,4],[96,1,96,4],[92,1,92,4],[89,1,89,4],[87,1,87,4],[84,1,84,4],[83,1,83,4],[74,1,74,4],[37,3,37,4],[38,3,38,4],[0,0,0,3],[35,0,35,4],[44,3,44,4],[7,3,7,4],[5,0,5,4],[11,3,11,4],[17,3,17,4],[31,3,31,4],[33,3,33,4],[6,3,6,4],[34,3,34,4],[24,3,24,4],[23,3,23,4],[41,3,41,4],[36,3,36,4],[21,3,21,4],[22,3,22,4],[73,0,73,4]]}
["Auslegung Kampmann Drallluftdurchlässe"]
[]
["Eingabefelder sind gelb gekennzeichnet"]
["Ergebnisfelder sind blau gekennzeichnet"]
[]
["Vorgaben"]
["Lüftungstechnik","Symbol","Einheit","Wert"]
["Bezeichung","Symbol","Einheit"]
[null,"L","mm"]
[null,"L","mm"]
[null,"L","mm"]
["Durchlass Typ",null,null,"DAL 358"]
[null,null,null,"DAL 359"]
[null,null,null,"DAL 358"]
[null,null,null,"DRS"]
[null,null,null,"MSA"]
[null,null,null,"DIA"]
["Nenn-Abmessung Frontblende","DN","[-]",800]
[null,null,null,300]
[null,null,null,400]
[null,null,null,500]
[null,null,null,600]
[null,null,null,625]
[null,null,null,800]
["Lochbild / Nenndurchmesser","DN","[-]",800]
[null,null,null,{"$f":"IF(AND(OR($D$12=\"DRS\",$D$12=\"DIA\"),OR($D$18=300,$D$18=400,$D$18=500,$D$18=600,$D$18=625,$D$18=800)),100,IF(OR($D$12=\"DAL 359\",$D$12=\"DAL 358\",$D$12=\"MSA\"),300,\"\"))","v":300}]
[null,null,null,{"$f":"IF(AND(OR($D$12=\"DRS\",$D$12=\"DIA\"),OR($D$18=300,$D$18=400,$D$18=500,$D$18=600,$D$18=625,$D$18=800)),125,IF(AND(OR($D$12=\"DAL 359\",$D$12=\"DAL 358\",$D$12=\"MSA\"),OR($D$18=400,$D$18=500,$D$18=600,$D$18=625,$D$18=800)),400,\"\"))","v":400}]
[null,null,null,{"$f":"IF(AND(OR($D$12=\"DRS\",$D$12=\"DIA\"),OR($D$18=300,$D$18=400,$D$18=500,$D$18=600,$D$18=625,$D$18=800)),180,IF(AND(OR($D$12=\"DAL 359\",$D$12=\"DAL 358\",$D$12=\"MSA\"),OR($D$18=500,$D$18=600,$D$18=625,$D$18=800)),500,\"\"))","v":500}]
[null,null,null,{"$f":"IF(AND(OR($D$12=\"DRS\",$D$12=\"DIA\"),OR($D$18=400,$D$18=500,$D$18=600,$D$18=625,$D$18=800)),250,IF(AND(OR($D$12=\"DAL 359\",$D$12=\"DAL 358\",$D$12=\"MSA\"),OR($D$18=600,$D$18=625,$D$18=800)),600,\"\"))","v":600}]
[null,null,null,{"$f":"IF(AND(OR($D$12=\"DRS\",$D$12=\"DIA\"),OR($D$18=500,$D$18=600,$D$18=625,$D$18=800)),315,IF(AND(OR($D$12=\"DAL 359\",$D$12=\"DAL 358\"),$D$18=800),800,\"\"))","v":800}]
[null,null,null,{"$f":"IF(AND(OR($D$12=\"DRS\",$D$12=\"DIA\"),OR($D$18=600,$D$18=625,$D$18=800)),355,IF(AND(OR($D$12=\"DAL 359\",$D$12=\"DAL 358\",$D$12=\"MSA\"),$D$18=800),\"\",\"\"))","v":""}]
["Luftvolumenstrom, Einzeldurchlass","V·SUP","m³/h",{"$f":"Vorgaben!$D$8/Vorgaben!$D$9","v":550}]
["max. Luftgeschwindigkeit im Aufenthaltsbereich","vMax","m/s",0.2]
["Temperatur Zuluft","tSUP","°C",{"$f":"Vorgaben!D10","v":16}]
["Temperatur Raum","tRaum","°C",{"$f":"Vorgaben!$D$11","v":26}]
["Raumdaten"]
["Raumhöhe","H1","m",{"$f":"Vorgaben!$D$14","v":3.05}]
["Obergrenze Aufenthaltsbereich","H2","m",{"$f":"Vorgaben!$D$15","v":1.83}]
["Raumlänge","LR","m",{"$f":"Vorgaben!$D$16","v":7.4},null,null,null,null,1,"Breite Anschlusskasten",{"$f":"Grunddaten!O33","v":794},"mm"]
["Raumbreite","BR","m",{"$f":"Vorgaben!$D$17","v":5.6},null,null,null,null,2,"Höhe Anschlusskasten",{"$f":"Grunddaten!N33","v":430},"mm"]
["Abstand Durchlass zur nächstgelegenen Wand","a","m",0.91,null,null,null,null,3,"Durchmesser Anschlussstutzen",{"$f":"Grunddaten!J33","v":315},"mm"]
["kleinster Abstand zwischen 2 Durchlässen","smin","m",2,null,null,null,null,4,"min. Abmessung Frontblende quadr.",{"$f":"Grunddaten!P33","v":800},"mm"]
[null,null,null,null,null,null,null,null,5,"min. Abmessung Frontblende rund",{"$f":"Grunddaten!Q33","v":800},"mm"]
["Akustikdaten",null,null,null,null,null,null,null,6,"Minimaler Volumenstrom",{"$f":"Grunddaten!$H$33","v":400},"m³/h"]
["Raumart nach VDI 2081",null,null,"Großraumbüro",null,null,null,null,7,"Maximaler Volumenstrom",{"$f":"Grunddaten!$I$33","v":1750},"m³/h"]
[null,null,"Einzelbüro",null,null,null,null,null,5,"min. Abmessung Frontblende rund",{"$f":"Grunddaten!Q33","v":800},"mm"]
[null,null,"Großraumbüro"]
[null,null,"Werkstätten"]
[null,null,"Ruheraum, Pausenraum"]
[null,null,"Untersuchungsraum Krankenhaus"]
[null,null,"Rundfunk-, Fernsehstudio"]
[null,null,"Chemielabor"]
[null,null,"Wasch- und WC-Raum, Umkleide"]
[null,null,"Schwimmbad"]
[null,null,"EDV-Raum"]
[null,null,"Konzertsaal"]
[null,null,"Lesesaal"]
[null,null,"Museum"]
[null,null,"Küche"]
[null,null,"Theater, Kino"]
[null,null,"Klassen- Seminarraum"]
[null,null,"Gaststätte"]
[null,null,"kein Typ"]
[null,null,"Konferenzraum"]
[null,null,"Hotelzimmer"]
[null,null,"Hörsaal"]
[null,null,"Bettenzimmer Krankenhaus"]
[null,null,"Verkaufsraum"]
[null,"","Sporthalle"]
["Betrachteter Durchlass",null,null,"Zuluft"]
[null,null,null,"Zuluft"]
[null,null,null,"Abluft"]
["Abstand zur Schallquelle","r","m",3]
["Zusatzdaten"]
["Funktion","",null,null,null,{"$f":"VLOOKUP(B75,Eingabe!$A$45:$B$48,2,FALSE)","v":{"$error":"#N/A"}},{"$f":"VLOOKUP($B$75,$B$76:$G$78,6,0)","v":"Z"}]
[null,{"$f":"IF(D12=500,\"Zuluft\",\"\")","v":""},null,null,null,null,"Z"]
[null,{"$f":"IF(D12=500,\"Abluft\",\"\")","v":""},null,null,null,null,"A"]
[null,{"$f":"IF(D12>500,\"Zuluft/Abluft-Kombination\",\"\")","v":"Zuluft/Abluft-Kombination"},null,null,null,null,"K"]
["Farbe Abdeckprofil und Endwinkel",9010,null,null,null,{"$f":"VLOOKUP(B79,Eingabe!A45:B48,2,FALSE)","v":{"$error":"#N/A"}},{"$f":"$B$79","v":9010}]
["Farbe Luftlenkelement","schwarz",null,null,null,null,{"$f":"VLOOKUP(B80,B81:G83,6,FALSE)","v":"S"}]
[null,"schwarz",null,null,null,null,"S"]
[null,"weiß",null,null,null,null,"W"]
[null,"grau",null,null,null,null,"G"]
["Einstellung Luftlenkelement","Deckenstrahl D / E",null,null,null,null,{"$f":"VLOOKUP(B84,B85:G88,6,FALSE)","v":"D"}]
[null,"Deckenstrahl D / E",null,null,null,null,"D"]
[null,"Sondereinstellung",null,null,null,null,"S"]
[]
["Werkstoff Anschlusskasten","Stahl verzinkt",null,null,null,null,"V"]
[null,"Stahl verzinkt"]
["frontseitig bedienbare Drossel","ohne",null,null,null,{"$f":"VLOOKUP(B90,Eingabe!$A$45:$B$51,2,FALSE)","v":{"$error":"#N/A"}},{"$f":"VLOOKUP(B90,B91:G93,6,FALSE)","v":0}]
[null,"mit",null,null,null,null,1]
[null,"ohne",null,null,null,null,0]
["Innenauskleidung","Baustoffklasse B1 (Standard)",null,null,null,null,{"$f":"VLOOKUP(B93,B94:G97,6,FALSE)","v":"B1"}]
[null,"Baustoffklasse B1 (Standard)",null,null,null,null,"B1"]
[null,"Baustoffklasse A2 (optional)",null,null,null,null,"A2"]
[]
["Merkmalschlüssel",{"$f":"CONCATENATE(1,\"KSW\",\"0\",D18,G97,G75,\"A\",G79,G80,G84,G88,G90,G93,1,G98)","v":"1KSW0800DAL 358ZA9010SDV0B11100"},null,null,null,null,{"$f":"IF(D12<1000,CONCATENATE(0,D12),D12)","v":"DAL 358"}]
[null,null,null,null,null,null,{"$f":"IF(K41=78,\"080\",100)","v":100}]
["Berechnung strömungstechnische und Akustische Daten",null,null,"Zuluft","Abluft"]
["Druckverlust","Dpt","Pa",{"$f":"IF(D70=\"Zuluft\",Grunddaten!$L$33,\"\")","v":12.08859461409336},{"$f":"IF(D70=\"Abluft\",IF(Grunddaten!M33=0,\"a. Anf\",Grunddaten!M33),\"\")","v":""}]
["kritischer Strahlweg","xkr.","m",{"$f":"IF(D70=\"Zuluft\",IF(D34>=D35,\"Heizfall\",xkr._vx!$F$11),\"\")","v":1.0522712375401038}]
["Laufweg bis Fußbodenbereich","xx","m",{"$f":"xkr._vx!L24","v":4.46}]
["Laufweg bis Aufenthaltsbereich nach Stoßpunkt","xx+y","m",{"$f":"xkr._vx!L26","v":3.2199999999999998}]
["Laufweg bis Aufenthaltsbereich nach xkrit","xxkr","m",{"$f":"IF(D34>=D35,\"Heizfall\",xkr._vx!L28)","v":2.7776117836352796}]
["Geschwindigkeit im Fußbodenbereich in Wandnähe","vx1","m/s",{"$f":"IF(D70=\"Zuluft\",IF(xkr._vx!$N$24< 0.1,\"< 0,1\",xkr._vx!$N$24),\"\")","v":"< 0,1"}]
["Zugluftrisiko am Fußboden**","DR1","%",{"$f":"IF(D70=\"Zuluft\",IF($D$34>$D$35,\"Heizfall\",DR!$C$16),\"\")","v":5.7205147172344128}]
[{"$f":"IF(AND(D34>D35,D12=\"MSA\"),\"Eindringtiefe (Walzenstellung CD)\",\"Geschwindigkeit im Aufenthaltsbereich*\")","v":"Geschwindigkeit im Aufenthaltsbereich*"},"vx2",{"$f":"IF(AND(D35<=D34,D12=\"MSA\"),\"m\",\"m/s\")","v":"m/s"},{"$f":"IF(D42=0,\"\",IF(D70=\"Zuluft\",IF($D$34>$D$35,xkr._vx!M31,IF(xkr._vx!$O$26<0.1,\"< 0,1\",xkr._vx!$O$26)),\"\"))","v":0.15379579051213171}]
["Zugluftrisiko im Aufenthaltsbereich**","DR2","%",{"$f":"IF(D42=0,\"\",IF(D70=\"Zuluft\",IF($D$34>$D$35,\"Heizfall\",DR!$D$24),\"\"))","v":11.689995969441734}]
["Geschwindigkeit nach Ablösen an Xkr.","vx3","m/s",{"$f":"IF(D70=\"Zuluft\",IF(xkr._vx!$N$28<0.1,\"<0,1\",IF($D$34>=$D$35,\"Heizfall\",xkr._vx!$N$28)),\"\")","v":0.15379579051213171}]
["Zugluftrisiko nach Ablösepunkt**","DR3","%",{"$f":"IF(D70=\"Zuluft\",IF($D$34>=$D$35,\"Heizfall\",DR!$C$32),\"\")","v":11.689995969441734}]
["Resultierende Raumkategorie","RAL","[-]",{"$f":"IF(D70=\"Zuluft\",IF(D34>=D35,\"Heizfall\",IF(AND($D$106<9.95,$D$108<9.95,$D$110<9.95),\"A\",IF(AND($D$106<19.95,$D$108<19.95,$D$110<19.95),\"B\",IF(AND($D$106<29.95,$D$108<29.95,$D$110<29.95),\"C\",\"Außerhalb C\")))),\"\")","v":"B"}]
[{"$f":"CONCATENATE(\"Schallleistungspegel, \",D70,\"durchlass\")","v":"Schallleistungspegel, Zuluftdurchlass"},"LWA_SUP/ETA","dB(A)",{"$f":"IF(D70=\"Zuluft\",Lw!I89,\"\")","v":29.790457212705405},{"$f":"IF(D70=\"Abluft\",IFERROR(Lw!I90,\"a. Anf\"),\"\")","v":""}]
["Schalldruckpegel, Zahlenwert Zuluft + Abluft",null,null,{"$f":"D112+10*LOG(Lw!$F$127/(4*PI()*Auslegung!D73^2)+4/(Lw!$H$127))","v":21.010852525929479},{"$f":"E112+10*LOG(Lw!$F$127/(4*PI()*Auslegung!E73^2)+4/(Lw!$H$127))","v":{"$error":"#VALUE!"}}]
[{"$f":"CONCATENATE(\"Schallldruckpegel in \",D73,\"m Entfernung, \",D70,\"durchlass\")","v":"Schallldruckpegel in 3m Entfernung, Zuluftdurchlass"},"LPA_SUP/ETA","dB(A)",{"$f":"IF(D70=\"Zuluft\",IF(D112=\"<25\",\"<25\",IF(D112+10*LOG(Lw!$F$127/(4*PI()*Auslegung!D73^2)+4/(Lw!$H$127))>=25,D112+10*LOG(Lw!$F$127/(4*PI()*Auslegung!D73^2)+4/(Lw!$H$127)),\"<25\")),\"\")","v":"<25"},{"$f":"IF(D70=\"Abluft\",IFERROR(IF(E112=\"<25\",\"<25\",IF(E112+10*LOG(Lw!$F$127/(4*PI()*Auslegung!D73^2)+4/(Lw!$H$127))>=25,E112+10*LOG(Lw!$F$127/(4*PI()*Auslegung!D73^2)+4/(Lw!$H$127)),\"<25\")),\"a. Anf\"),\"\")","v":""}]
["Schalldruckpegel rechnerisch ",null,null,{"$f":"IF(10*LOG(10^(D113/10)+10^(E113/10))<25,\"<25\",10*LOG(10^(D113/10)+10^(E113/10)))","v":{"$error":"#VALUE!"}}]
["Summen-Schallldruckpegel im betrachteten Punkt","LPA","dB(A)",{"$f":"IFERROR(IF(E113-D113>6,MAX(E113,D113),D115),IF(E114=\"a. Anf\",D114,IF(AND(D114=\"<25\",E114=\"<25\"),\"<25\",\"a. Anf\")))","v":"a. Anf"}]
["*Gilt für Eintritt der Luftströmung in den Aufenthaltbereich nach dem Stoßpunkt"]
["** Berechnung gemäß DIN EN ISO 7730"]
[]
["Oktavspektrum Schallleistung","LW_Okt","dB",{"$f":"D99","v":"Zuluft"},{"$f":"E99","v":"Abluft"}]
[null,"LW_125","dB",{"$f":"IF($D$70=\"Zuluft\",IFERROR(Lw!B$91,\"a. Anf\"),\"\")","v":33.286855246168983},{"$f":"IF($D$70=\"Abluft\",IFERROR(Lw!B$92,\"a. Anf\"),\"\")","v":""}]
[null,"LW_250","dB",{"$f":"IF($D$70=\"Zuluft\",IFERROR(Lw!C$91,\"a. Anf\"),\"\")","v":31.896516489461199},{"$f":"IF($D$70=\"Abluft\",IFERROR(Lw!C$92,\"a. Anf\"),\"\")","v":""}]
[null,"LW_500","dB",{"$f":"IF($D$70=\"Zuluft\",IFERROR(Lw!D$91,\"a. Anf\"),\"\")","v":27.737626466343599},{"$f":"IF($D$70=\"Abluft\",IFERROR(Lw!D$92,\"a. Anf\"),\"\")","v":""}]
[null,"LW_1000","dB",{"$f":"IF($D$70=\"Zuluft\",IFERROR(Lw!E$91,\"a. Anf\"),\"\")","v":23.682560589963288},{"$f":"IF($D$70=\"Abluft\",IFERROR(Lw!E$92,\"a. Anf\"),\"\")","v":""}]
[null,"LW_2000","dB",{"$f":"IF($D$70=\"Zuluft\",IFERROR(Lw!F$91,\"a. Anf\"),\"\")","v":17.002580384256344},{"$f":"IF($D$70=\"Abluft\",IFERROR(Lw!F$92,\"a. Anf\"),\"\")","v":""}]
[null,"LW_4000","dB",{"$f":"IF($D$70=\"Zuluft\",IFERROR(Lw!G$91,\"a. Anf\"),\"\")","v":14.52418234064816},{"$f":"IF($D$70=\"Abluft\",IFERROR(Lw!G$92,\"a. Anf\"),\"\")","v":""}]
[null,"LW_8000","dB",{"$f":"IF($D$70=\"Zuluft\",IFERROR(Lw!H$91,\"a. Anf\"),\"\")","v":9.0401496455248793},{"$f":"IF($D$70=\"Abluft\",IFERROR(Lw!H$92,\"a. Anf\"),\"\")","v":""}]
[]
["Änderungen vorbehalten"]
["Stand:",null,null,null,{"$f":"IF(D12=500,KSW(),\"\")","v":""}]
[{"$f":"Grunddaten!E36","v":"2020-10-30"}]

{"sheet":"Funktion","index":4,"n_rows":0,"n_cols":0,"rows_kept":0,"cut":false,"hidden":true,"merged":[]}

{"sheet":"Maße","index":5,"n_rows":0,"n_cols":0,"rows_kept":0,"cut":false,"hidden":true,"merged":[]}

{"sheet":"Datenblatt","index":6,"n_rows":44,"n_cols":9,"rows_kept":44,"cut":false,"hidden":false,"merged":[[34,2,34,3],[33,5,33,6],[33,2,33,3],[9,0,9,8],[18,6,18,7],[29,5,29,6],[30,5,30,6],[31,5,31,6],[1,1,1,7],[32,2,32,3],[32,5,32,6],[22,2,22,3],[23,2,23,3],[24,2,24,3],[25,2,25,3],[26,2,26,3],[27,2,27,3],[28,2,28,3],[29,2,29,3],[30,2,30,3],[31,2,31,3],[5,6,5,7],[5,2,5,4]]}
[]
["Typ",{"$f":"Auslegung!$D$12","v":"DAL 358"},null,null,null,null,null,null,{"$f":"TODAY()","v":"2021-01-05"}]
["Projekt","bitte Projektname / VIS-Nr. eintragen"]
[]
["Definition:"]
["Durchlass, Typ:",{"$f":"Auslegung!$D$12","v":"DAL 358"},"Nenndurchmesser:",null,null,{"$f":"Auslegung!$D$18","v":800},"Lochbild:",null,{"$f":"Auslegung!D25","v":800}]
["Schlitzanzahl:",{"$f":"Auslegung!D18","v":800},"Farbe Abdeckprofil:",null,{"$f":"Auslegung!B79","v":9010}]
["Innenauskleidung:",{"$f":"Auslegung!G93","v":"B1"},"Drossel fb:",null,{"$f":"Auslegung!B90","v":"ohne"}]
[]
["Beschreibung:\nHochinduktiver Drallluftdurchlass für den Einbau in Zwischendecken (Einlegedecken)\nMit optionalem Anschlusskasten in quadratischer oder runder Bauform\n"]
["Einsatzbereich"]
["Minimalvolumenstrom","V°min",{"$f":"Auslegung!K44","v":400},"m³/h"]
["Maximalvolumenstrom","V°max",{"$f":"Auslegung!K45","v":1750},"m³/h"]
[]
["technische Vorgaben",null,null,null,null,"Raumdaten"]
["Luftvolumenstrom Zuluft","V·SUP",{"$f":"Auslegung!D32","v":550},"m³/h",null,"Raumhöhe",{"$f":"Auslegung!D37","v":3.05},"m"]
["Temperatur Zuluft","tZUL",{"$f":"Auslegung!D34","v":16},"°C",null,"Raumbreite ",{"$f":"Auslegung!D40","v":5.6},"m"]
["Temperatur Raum","tRAUM",{"$f":"Auslegung!D35","v":26},"°C",null,"Raumlänge",{"$f":"Auslegung!D39","v":7.4},"m"]
[{"$f":"Auslegung!A41","v":"Abstand Durchlass zur nächstgelegenen Wand"},{"$f":"Auslegung!B41","v":"a"},{"$f":"Auslegung!D41","v":0.91},"m",null,"Nutzungsart",{"$f":"Auslegung!D45","v":"Großraumbüro"}]
[{"$f":"Auslegung!A42","v":"kleinster Abstand zwischen 2 Durchlässen"},"smin",{"$f":"Auslegung!D42","v":2},"m"]
[]
["technische Daten"]
[{"$f":"CONCATENATE(\"Druckverlust \",Auslegung!D70,\"durchlass\")","v":"Druckverlust Zuluftdurchlass"},"Dp_SUP/ETA",{"$f":"IF(Auslegung!D100=\"\",Auslegung!E100,Auslegung!D100)","v":12.08859461409336},null,"Pa"]
["kritischer Strahlweg","xkr.",{"$f":"Auslegung!D101","v":1.0522712375401038},null,"m"]
[{"$f":"Auslegung!A105","v":"Geschwindigkeit im Fußbodenbereich in Wandnähe"},"vx1",{"$f":"Auslegung!D105","v":"< 0,1"},null,"m/s"]
[{"$f":"Auslegung!A106","v":"Zugluftrisiko am Fußboden**"},"DR1",{"$f":"Auslegung!$D$106","v":5.7205147172344128},null,"%"]
[{"$f":"Auslegung!A107","v":"Geschwindigkeit im Aufenthaltsbereich*"},"vx2",{"$f":"Auslegung!$D$107","v":0.15379579051213171},null,"m/s"]
[{"$f":"Auslegung!A108","v":"Zugluftrisiko im Aufenthaltsbereich**"},"DR2",{"$f":"Auslegung!$D$108","v":11.689995969441734},null,"%"]
[{"$f":"Auslegung!A109","v":"Geschwindigkeit nach Ablösen an Xkr."},"vx3",{"$f":"Auslegung!$D$109","v":0.15379579051213171},null,"m/s","Maße"]
[{"$f":"Auslegung!A110","v":"Zugluftrisiko nach Ablösepunkt**"},"DR3",{"$f":"Auslegung!$D$110","v":11.689995969441734},null,"%",{"$f":"Auslegung!J42","v":"min. Abmessung Frontblende quadr."},null,{"$f":"Auslegung!K42","v":800},"mm"]
["Raumkategorie**","RAL",{"$f":"Auslegung!D111","v":"B"},null,{"$f":"\"-/-\"","v":"-/-"},{"$f":"Auslegung!J43","v":"min. Abmessung Frontblende rund"},null,{"$f":"Auslegung!K43","v":800},"mm"]
[{"$f":"Auslegung!$A$112","v":"Schallleistungspegel, Zuluftdurchlass"},"LWA_SUP/ETA",{"$f":"IF(Auslegung!D112=\"\",Auslegung!E112,Auslegung!D112)","v":29.790457212705405},null,"dB(A)",{"$f":"Auslegung!J39","v":"Breite Anschlusskasten"},null,{"$f":"Auslegung!K39","v":794},"mm"]
[{"$f":"Auslegung!A114","v":"Schallldruckpegel in 3m Entfernung, Zuluftdurchlass"},"LPA_SUP",{"$f":"IF(Auslegung!D114=\"\",Auslegung!E114,Auslegung!D114)","v":"<25"},null,"dB(A)",{"$f":"Auslegung!J40","v":"Höhe Anschlusskasten"},null,{"$f":"Auslegung!K40","v":430},"mm"]
[null,null,null,null,null,{"$f":"Auslegung!J41","v":"Durchmesser Anschlussstutzen"},null,{"$f":"Auslegung!K41","v":315},"mm"]
[]
["*Gilt für Eintritt der Luftströmung in den Aufenthaltbereich nach dem Stoßpunkt"]
["** Raumkategorie nach DIN EN ISO 7730: DR<10 % = A; DR<20 % = B; DR<30 % = C"]
[]
[]
["Oktavspektrum Schallleistungspegel","f [Hz]",125,250,500,1000,2000,4000,8000]
[{"$f":"Auslegung!D70","v":"Zuluft"},"LWA_Okt",{"$f":"IF(Auslegung!$D$121=\"\",Auslegung!$E$121,Auslegung!$D$121)","v":33.286855246168983},{"$f":"IF(Auslegung!$D$122=\"\",Auslegung!$E$122,Auslegung!$D$122)","v":31.896516489461199},{"$f":"IF(Auslegung!$D$123=\"\",Auslegung!$E$123,Auslegung!$D$123)","v":27.737626466343599},{"$f":"IF(Auslegung!$D$124=\"\",Auslegung!$E$124,Auslegung!$D$124)","v":23.682560589963288},{"$f":"IF(Auslegung!$D$125=\"\",Auslegung!$E$125,Auslegung!$D$125)","v":17.002580384256344},{"$f":"IF(Auslegung!$D$126=\"\",Auslegung!$E$126,Auslegung!$D$126)","v":14.52418234064816},{"$f":"IF(Auslegung!$D$127=\"\",Auslegung!$E$127,Auslegung!$D$127)","v":9.0401496455248793}]
[]
[null,null,null,null,null,null,null,null,"technische Änderungen vorbehalten"]
[null,null,null,null,null,null,null,"Stand:",{"$f":"Grunddaten!$E$36","v":"2020-10-30"}]

{"sheet":"Grunddaten","index":7,"n_rows":52,"n_cols":29,"rows_kept":52,"cut":false,"hidden":true,"merged":[[1,17,1,18],[0,17,0,23],[1,19,1,23],[0,25,0,28]]}
["Typ","DN",null,"Baulänge","Schlitzanzahl","Schlitzlänge","Soll-Volumenstrom","V° Auslegung min","V° Auslegung max","Durchmesser Anschluss","Anströmgeschwindigkeit","Druckverlust, Zuluft","Druckverlust, Abluft","Höhe Anschlusskasten","Breite Anschlusskasten","min. Abmessungen Frontblende quadratisch","min. Abmessungen Frontblende rund","Vorauswahlkriterien",null,null,null,null,null,null,null,"Vorauswahl zur Anzeige"]
[null,"Lochbild",null,"l","n","L","V°","V°min","V°max","d","v","Dp","Dp","h","b","b1","x","Volumenstrom",null,"Schallleistungspegel",null,null,null,null,"Auslass freigegeben?"]
[null,null,null,"mm",1,"mm","m³/h","m³/h","m³/h","mm","m/s","Pa","Pa","mm","mm","mm","mm","größer als v°min?","kleiner als V°max?","K021","K022","dB","größer als 0dB(A)?","kleiner als LW,Amax?",null,null,null,{"$f":"IF(ROW(AA3)>COUNTA(AA:AA),\"\",INDEX(AA3:AA28,SMALL(IF(AA$4:AA$29<>\"\",ROW($4:$29)),ROW($AA3))))","v":""}]
["DAL 359",300,{"$f":"CONCATENATE(A4,B4)","v":"DAL 359300"},null,null,null,{"$f":"Auslegung!$D$32","v":550},50,300,160,{"$f":"Auslegung!$D$32/(PI()/4*(Grunddaten!J4/1000)^2*3600)","v":7.5985432899776422},{"$f":"SUM('DAL359-CAP'!$C$40,'DAL358-CAP'!$C$40,'DRS-CAP'!$C$40,'DIA-CAP'!$C$40,'MSA-CAP'!$C$40)*Grunddaten!G4^(SUM('DAL359-CAP'!$C$41,'DAL358-CAP'!$C$41,'DRS-CAP'!$C$41,'DIA-CAP'!$C$41,'MSA-CAP'!$C$41))","v":12.08859461409336},{"$f":"SUM('DAL359-CAP'!$C$68,'DAL358-CAP'!$C$68,'DRS-CAP'!$C$68,'DIA-CAP'!$C$68,'MSA-CAP'!$C$68)*Grunddaten!G4^(SUM('DAL359-CAP'!$C$69,'DAL358-CAP'!$C$69,'DRS-CAP'!$C$69,'DIA-CAP'!$C$69,'MSA-CAP'!$C$69))","v":0},275,292,298,300,{"$f":"IF(Vorgaben!$D$8/Vorgaben!$D$9>=Grunddaten!$H4,\"x\",\"\")","v":"x"},{"$f":"IF(Vorgaben!$D$8/Vorgaben!$D$9<=Grunddaten!$I4,\"x\",\"\")","v":""},-93.241728860158958,61.295195452125157,{"$f":"T4+U4*LOG(Vorgaben!$D$8/Vorgaben!$D$9)","v":74.729337802102066},{"$f":"IF(V4>0,\"x\",\"\")","v":"x"},{"$f":"IF(V4<=Vorgaben!$D$12,\"x\",\"\")","v":""},"x",{"$f":"IF(AND(R4=\"x\",S4=\"x\",W4=\"x\",X4=\"x\",Y4=\"x\"),\"x\",\"\")","v":""},{"$f":"IF(Z4=\"x\",CONCATENATE(A4,\" DN \",B4),\"\")","v":""},{"$f":"IF(ROW(AA1)>COUNTA(AA:AA),\"\",INDEX(AA:AA,SMALL(IF(AA$1:AA$29<>\"\",ROW($1:$29)),ROW($AA1))))","v":"DAL 359 DN 600"},{"$f":"IFERROR(AB4,\"\")","v":"DAL 359 DN 600"}]
["DAL 359",400,{"$f":"CONCATENATE(A5,B5)","v":"DAL 359400"},null,null,null,{"$f":"Auslegung!$D$32","v":550},200,500,200,{"$f":"Auslegung!$D$32/(PI()/4*(Grunddaten!J5/1000)^2*3600)","v":4.8630677055856903},{"$f":"SUM('DAL359-CAP'!$C$40,'DAL358-CAP'!$C$40,'DRS-CAP'!$C$40,'DIA-CAP'!$C$40,'MSA-CAP'!$C$40)*Grunddaten!G5^(SUM('DAL359-CAP'!$C$41,'DAL358-CAP'!$C$41,'DRS-CAP'!$C$41,'DIA-CAP'!$C$41,'MSA-CAP'!$C$41))","v":12.08859461409336},{"$f":"SUM('DAL359-CAP'!$C$68,'DAL358-CAP'!$C$68,'DRS-CAP'!$C$68,'DIA-CAP'!$C$68,'MSA-CAP'!$C$68)*Grunddaten!G5^(SUM('DAL359-CAP'!$C$69,'DAL358-CAP'!$C$69,'DRS-CAP'!$C$69,'DIA-CAP'!$C$69,'MSA-CAP'!$C$69))","v":0},315,392,398,400,{"$f":"IF(Vorgaben!$D$8/Vorgaben!$D$9>=Grunddaten!$H5,\"x\",\"\")","v":"x"},{"$f":"IF(Vorgaben!$D$8/Vorgaben!$D$9<=Grunddaten!$I5,\"x\",\"\")","v":""},-113.4,58.16,{"$f":"T5+U5*LOG(Vorgaben!$D$8/Vorgaben!$D$9)","v":45.979494020985186},{"$f":"IF(V5>0,\"x\",\"\")","v":"x"},{"$f":"IF(V5<=Vorgaben!$D$12,\"x\",\"\")","v":""},"x",{"$f":"IF(AND(R5=\"x\",S5=\"x\",W5=\"x\",X5=\"x\",Y5=\"x\"),\"x\",\"\")","v":""},{"$f":"IF(Z5=\"x\",CONCATENATE(A5,\" DN \",B5),\"\")","v":""},{"$f":"IF(ROW(AA2)>COUNTA(AA:AA),\"\",INDEX(AA:AA,SMALL(IF(AA$1:AA$29<>\"\",ROW($1:$29)),ROW($AA2))))","v":"DAL 358 DN 800"},{"$f":"IFERROR(AB5,\"\")","v":"DAL 358 DN 800"}]
["DAL 359",500,"DAL 359500",null,null,null,{"$f":"Auslegung!$D$32","v":550},300,700,225,{"$f":"Auslegung!$D$32/(PI()/4*(Grunddaten!J6/1000)^2*3600)","v":3.8424238661417802},{"$f":"SUM('DAL359-CAP'!$C$40,'DAL358-CAP'!$C$40,'DRS-CAP'!$C$40,'DIA-CAP'!$C$40,'MSA-CAP'!$C$40)*Grunddaten!G6^(SUM('DAL359-CAP'!$C$41,'DAL358-CAP'!$C$41,'DRS-CAP'!$C$41,'DIA-CAP'!$C$41,'MSA-CAP'!$C$41))","v":12.08859461409336},{"$f":"SUM('DAL359-CAP'!$C$68,'DAL358-CAP'!$C$68,'DRS-CAP'!$C$68,'DIA-CAP'!$C$68,'MSA-CAP'!$C$68)*Grunddaten!G6^(SUM('DAL359-CAP'!$C$69,'DAL358-CAP'!$C$69,'DRS-CAP'!$C$69,'DIA-CAP'!$C$69,'MSA-CAP'!$C$69))","v":0},340,492,498,500,{"$f":"IF(Vorgaben!$D$8/Vorgaben!$D$9>=Grunddaten!$H6,\"x\",\"\")","v":"x"},{"$f":"IF(Vorgaben!$D$8/Vorgaben!$D$9<=Grunddaten!$I6,\"x\",\"\")","v":"x"},-125.2,58.87,{"$f":"T6+U6*LOG(Vorgaben!$D$8/Vorgaben!$D$9)","v":36.125151530526111},"x",{"$f":"IF(V6<=Vorgaben!$D$12,\"x\",\"\")","v":""},"x","","",{"$f":"IF(ROW(AA3)>COUNTA(AA:AA),\"\",INDEX(AA:AA,SMALL(IF(AA$1:AA$29<>\"\",ROW($1:$29)),ROW($AA3))))","v":"DRS DN 315"},"DRS DN 315"]
["DAL 359",600,"DAL 359600",null,null,null,{"$f":"Auslegung!$D$32","v":550},500,1200,250,{"$f":"Auslegung!$D$32/(PI()/4*(Grunddaten!J7/1000)^2*3600)","v":3.1123633315748425},{"$f":"SUM('DAL359-CAP'!$C$40,'DAL358-CAP'!$C$40,'DRS-CAP'!$C$40,'DIA-CAP'!$C$40,'MSA-CAP'!$C$40)*Grunddaten!G7^(SUM('DAL359-CAP'!$C$41,'DAL358-CAP'!$C$41,'DRS-CAP'!$C$41,'DIA-CAP'!$C$41,'MSA-CAP'!$C$41))","v":12.08859461409336},{"$f":"SUM('DAL359-CAP'!$C$68,'DAL358-CAP'!$C$68,'DRS-CAP'!$C$68,'DIA-CAP'!$C$68,'MSA-CAP'!$C$68)*Grunddaten!G7^(SUM('DAL359-CAP'!$C$69,'DAL358-CAP'!$C$69,'DRS-CAP'!$C$69,'DIA-CAP'!$C$69,'MSA-CAP'!$C$69))","v":0},365,614,595,600,{"$f":"IF(Vorgaben!$D$8/Vorgaben!$D$9>=Grunddaten!$H7,\"x\",\"\")","v":"x"},{"$f":"IF(Vorgaben!$D$8/Vorgaben!$D$9<=Grunddaten!$I7,\"x\",\"\")","v":"x"},-142.40600000000001,63.15,{"$f":"T7+U7*LOG(Vorgaben!$D$8/Vorgaben!$D$9)","v":30.647903841561487},"x",{"$f":"IF(V7<=Vorgaben!$D$12,\"x\",\"\")","v":"x"},"x","x","DAL 359 DN 600",{"$f":"IF(ROW(AA4)>COUNTA(AA:AA),\"\",INDEX(AA:AA,SMALL(IF(AA$1:AA$29<>\"\",ROW($1:$29)),ROW($AA4))))","v":"DRS DN 355"},"DRS DN 355"]
["DAL 359",800,"DAL 359800",null,null,null,{"$f":"Auslegung!$D$32","v":550},800,2000,315,{"$f":"Auslegung!$D$32/(PI()/4*(Grunddaten!J8/1000)^2*3600)","v":1.9604203398682551},{"$f":"SUM('DAL359-CAP'!$C$40,'DAL358-CAP'!$C$40,'DRS-CAP'!$C$40,'DIA-CAP'!$C$40,'MSA-CAP'!$C$40)*Grunddaten!G8^(SUM('DAL359-CAP'!$C$41,'DAL358-CAP'!$C$41,'DRS-CAP'!$C$41,'DIA-CAP'!$C$41,'MSA-CAP'!$C$41))","v":12.08859461409336},{"$f":"SUM('DAL359-CAP'!$C$68,'DAL358-CAP'!$C$68,'DRS-CAP'!$C$68,'DIA-CAP'!$C$68,'MSA-CAP'!$C$68)*Grunddaten!G8^(SUM('DAL359-CAP'!$C$69,'DAL358-CAP'!$C$69,'DRS-CAP'!$C$69,'DIA-CAP'!$C$69,'MSA-CAP'!$C$69))","v":0},430,794,800,800,{"$f":"IF(Vorgaben!$D$8/Vorgaben!$D$9>=Grunddaten!$H8,\"x\",\"\")","v":""},{"$f":"IF(Vorgaben!$D$8/Vorgaben!$D$9<=Grunddaten!$I8,\"x\",\"\")","v":"x"},-142.9,56.58,{"$f":"T8+U8*LOG(Vorgaben!$D$8/Vorgaben!$D$9)","v":12.149720971584287},"x",{"$f":"IF(V8<=Vorgaben!$D$12,\"x\",\"\")","v":"x"},"x","","",{"$f":"IF(ROW(AA5)>COUNTA(AA:AA),\"\",INDEX(AA:AA,SMALL(IF(AA$1:AA$29<>\"\",ROW($1:$29)),ROW($AA5))))","v":"MSA DN 600"},"MSA DN 600"]
["DAL 358",300,"DAL 358300",null,null,null,{"$f":"Auslegung!$D$32","v":550},40,250,160,{"$f":"Auslegung!$D$32/(PI()/4*(Grunddaten!J9/1000)^2*3600)","v":7.5985432899776422},{"$f":"SUM('DAL359-CAP'!$C$40,'DAL358-CAP'!$C$40,'DRS-CAP'!$C$40,'DIA-CAP'!$C$40,'MSA-CAP'!$C$40)*Grunddaten!G9^(SUM('DAL359-CAP'!$C$41,'DAL358-CAP'!$C$41,'DRS-CAP'!$C$41,'DIA-CAP'!$C$41,'MSA-CAP'!$C$41))","v":12.08859461409336},{"$f":"SUM('DAL359-CAP'!$C$68,'DAL358-CAP'!$C$68,'DRS-CAP'!$C$68,'DIA-CAP'!$C$68,'MSA-CAP'!$C$68)*Grunddaten!G9^(SUM('DAL359-CAP'!$C$69,'DAL358-CAP'!$C$69,'DRS-CAP'!$C$69,'DIA-CAP'!$C$69,'MSA-CAP'!$C$69))","v":0},275,292,298,300,{"$f":"IF(Vorgaben!$D$8/Vorgaben!$D$9>=Grunddaten!$H9,\"x\",\"\")","v":"x"},{"$f":"IF(Vorgaben!$D$8/Vorgaben!$D$9<=Grunddaten!$I9,\"x\",\"\")","v":""},-65.683763355297202,48.466188743658236,{"$f":"T9+U9*LOG(Vorgaben!$D$8/Vorgaben!$D$9)","v":67.131171979809722},"x",{"$f":"IF(V9<=Vorgaben!$D$12,\"x\",\"\")","v":""},"x","","",{"$f":"IF(ROW(AA6)>COUNTA(AA:AA),\"\",INDEX(AA:AA,SMALL(IF(AA$1:AA$29<>\"\",ROW($1:$29)),ROW($AA6))))","v":{"$error":"#NUM!"}},""]
["DAL 358",400,"DAL 358400",null,null,null,{"$f":"Auslegung!$D$32","v":550},130,700,200,{"$f":"Auslegung!$D$32/(PI()/4*(Grunddaten!J10/1000)^2*3600)","v":4.8630677055856903},{"$f":"SUM('DAL359-CAP'!$C$40,'DAL358-CAP'!$C$40,'DRS-CAP'!$C$40,'DIA-CAP'!$C$40,'MSA-CAP'!$C$40)*Grunddaten!G10^(SUM('DAL359-CAP'!$C$41,'DAL358-CAP'!$C$41,'DRS-CAP'!$C$41,'DIA-CAP'!$C$41,'MSA-CAP'!$C$41))","v":12.08859461409336},{"$f":"SUM('DAL359-CAP'!$C$68,'DAL358-CAP'!$C$68,'DRS-CAP'!$C$68,'DIA-CAP'!$C$68,'MSA-CAP'!$C$68)*Grunddaten!G10^(SUM('DAL359-CAP'!$C$69,'DAL358-CAP'!$C$69,'DRS-CAP'!$C$69,'DIA-CAP'!$C$69,'MSA-CAP'!$C$69))","v":0},315,392,398,400,{"$f":"IF(Vorgaben!$D$8/Vorgaben!$D$9>=Grunddaten!$H10,\"x\",\"\")","v":"x"},{"$f":"IF(Vorgaben!$D$8/Vorgaben!$D$9<=Grunddaten!$I10,\"x\",\"\")","v":"x"},-97.77,56.79,{"$f":"T10+U10*LOG(Vorgaben!$D$8/Vorgaben!$D$9)","v":57.855197136378095},"x",{"$f":"IF(V10<=Vorgaben!$D$12,\"x\",\"\")","v":""},"x","","",{"$f":"IF(ROW(AA7)>COUNTA(AA:AA),\"\",INDEX(AA:AA,SMALL(IF(AA$1:AA$29<>\"\",ROW($1:$29)),ROW($AA7))))","v":{"$error":"#NUM!"}},""]
["DAL 358",500,"DAL 358500",null,null,null,{"$f":"Auslegung!$D$32","v":550},200,800,225,{"$f":"Auslegung!$D$32/(PI()/4*(Grunddaten!J11/1000)^2*3600)","v":3.8424238661417802},{"$f":"SUM('DAL359-CAP'!$C$40,'DAL358-CAP'!$C$40,'DRS-CAP'!$C$40,'DIA-CAP'!$C$40,'MSA-CAP'!$C$40)*Grunddaten!G11^(SUM('DAL359-CAP'!$C$41,'DAL358-CAP'!$C$41,'DRS-CAP'!$C$41,'DIA-CAP'!$C$41,'MSA-CAP'!$C$41))","v":12.08859461409336},{"$f":"SUM('DAL359-CAP'!$C$68,'DAL358-CAP'!$C$68,'DRS-CAP'!$C$68,'DIA-CAP'!$C$68,'MSA-CAP'!$C$68)*Grunddaten!G11^(SUM('DAL359-CAP'!$C$69,'DAL358-CAP'!$C$69,'DRS-CAP'!$C$69,'DIA-CAP'!$C$69,'MSA-CAP'!$C$69))","v":0},340,492,498,500,{"$f":"IF(Vorgaben!$D$8/Vorgaben!$D$9>=Grunddaten!$H11,\"x\",\"\")","v":"x"},{"$f":"IF(Vorgaben!$D$8/Vorgaben!$D$9<=Grunddaten!$I11,\"x\",\"\")","v":"x"},-124.54,62.47,{"$f":"T11+U11*LOG(Vorgaben!$D$8/Vorgaben!$D$9)","v":46.650457212705405},"x",{"$f":"IF(V11<=Vorgaben!$D$12,\"x\",\"\")","v":""},"x","","",{"$f":"IF(ROW(AA8)>COUNTA(AA:AA),\"\",INDEX(AA:AA,SMALL(IF(AA$1:AA$29<>\"\",ROW($1:$29)),ROW($AA8))))","v":{"$error":"#NUM!"}},""]
["DAL 358",600,"DAL 358600",null,null,null,{"$f":"Auslegung!$D$32","v":550},300,1000,250,{"$f":"Auslegung!$D$32/(PI()/4*(Grunddaten!J12/1000)^2*3600)","v":3.1123633315748425},{"$f":"SUM('DAL359-CAP'!$C$40,'DAL358-CAP'!$C$40,'DRS-CAP'!$C$40,'DIA-CAP'!$C$40,'MSA-CAP'!$C$40)*Grunddaten!G12^(SUM('DAL359-CAP'!$C$41,'DAL358-CAP'!$C$41,'DRS-CAP'!$C$41,'DIA-CAP'!$C$41,'MSA-CAP'!$C$41))","v":12.08859461409336},{"$f":"SUM('DAL359-CAP'!$C$68,'DAL358-CAP'!$C$68,'DRS-CAP'!$C$68,'DIA-CAP'!$C$68,'MSA-CAP'!$C$68)*Grunddaten!G12^(SUM('DAL359-CAP'!$C$69,'DAL358-CAP'!$C$69,'DRS-CAP'!$C$69,'DIA-CAP'!$C$69,'MSA-CAP'!$C$69))","v":0},365,614,595,600,{"$f":"IF(Vorgaben!$D$8/Vorgaben!$D$9>=Grunddaten!$H12,\"x\",\"\")","v":"x"},{"$f":"IF(Vorgaben!$D$8/Vorgaben!$D$9<=Grunddaten!$I12,\"x\",\"\")","v":"x"},-136.30000000000001,63.1,{"$f":"T12+U12*LOG(Vorgaben!$D$8/Vorgaben!$D$9)","v":36.616885707086766},"x",{"$f":"IF(V12<=Vorgaben!$D$12,\"x\",\"\")","v":""},"x","","",{"$f":"IF(ROW(AA9)>COUNTA(AA:AA),\"\",INDEX(AA:AA,SMALL(IF(AA$1:AA$29<>\"\",ROW($1:$29)),ROW($AA9))))","v":{"$error":"#NUM!"}},""]
["DAL 358",800,"DAL 358800",null,null,null,{"$f":"Auslegung!$D$32","v":550},400,1750,315,{"$f":"Auslegung!$D$32/(PI()/4*(Grunddaten!J13/1000)^2*3600)","v":1.9604203398682551},{"$f":"SUM('DAL359-CAP'!$C$40,'DAL358-CAP'!$C$40,'DRS-CAP'!$C$40,'DIA-CAP'!$C$40,'MSA-CAP'!$C$40)*Grunddaten!G13^(SUM('DAL359-CAP'!$C$41,'DAL358-CAP'!$C$41,'DRS-CAP'!$C$41,'DIA-CAP'!$C$41,'MSA-CAP'!$C$41))","v":12.08859461409336},{"$f":"SUM('DAL359-CAP'!$C$68,'DAL358-CAP'!$C$68,'DRS-CAP'!$C$68,'DIA-CAP'!$C$68,'MSA-CAP'!$C$68)*Grunddaten!G13^(SUM('DAL359-CAP'!$C$69,'DAL358-CAP'!$C$69,'DRS-CAP'!$C$69,'DIA-CAP'!$C$69,'MSA-CAP'!$C$69))","v":0},430,794,800,800,{"$f":"IF(Vorgaben!$D$8/Vorgaben!$D$9>=Grunddaten!$H13,\"x\",\"\")","v":"x"},{"$f":"IF(Vorgaben!$D$8/Vorgaben!$D$9<=Grunddaten!$I13,\"x\",\"\")","v":"x"},-141.4,62.47,{"$f":"T13+U13*LOG(Vorgaben!$D$8/Vorgaben!$D$9)","v":29.790457212705405},"x",{"$f":"IF(V13<=Vorgaben!$D$12,\"x\",\"\")","v":"x"},"x","x","DAL 358 DN 800",{"$f":"IF(ROW(AA10)>COUNTA(AA:AA),\"\",INDEX(AA:AA,SMALL(IF(AA$1:AA$29<>\"\",ROW($1:$29)),ROW($AA10))))","v":{"$error":"#NUM!"}},""]
["DRS",100,"DRS100",null,null,null,{"$f":"Auslegung!$D$32","v":550},25,100,100,{"$f":"Auslegung!$D$32/(PI()/4*(Grunddaten!J14/1000)^2*3600)","v":19.452270822342761},{"$f":"SUM('DAL359-CAP'!$C$40,'DAL358-CAP'!$C$40,'DRS-CAP'!$C$40,'DIA-CAP'!$C$40,'MSA-CAP'!$C$40)*Grunddaten!G14^(SUM('DAL359-CAP'!$C$41,'DAL358-CAP'!$C$41,'DRS-CAP'!$C$41,'DIA-CAP'!$C$41,'MSA-CAP'!$C$41))","v":12.08859461409336},{"$f":"SUM('DAL359-CAP'!$C$68,'DAL358-CAP'!$C$68,'DRS-CAP'!$C$68,'DIA-CAP'!$C$68,'MSA-CAP'!$C$68)*Grunddaten!G14^(SUM('DAL359-CAP'!$C$69,'DAL358-CAP'!$C$69,'DRS-CAP'!$C$69,'DIA-CAP'!$C$69,'MSA-CAP'!$C$69))","v":0},177,122,620,155,{"$f":"IF(Vorgaben!$D$8/Vorgaben!$D$9>=Grunddaten!$H14,\"x\",\"\")","v":"x"},{"$f":"IF(Vorgaben!$D$8/Vorgaben!$D$9<=Grunddaten!$I14,\"x\",\"\")","v":""},-63.18,49.43,{"$f":"T14+U14*LOG(Vorgaben!$D$8/Vorgaben!$D$9)","v":72.276127741700464},"x",{"$f":"IF(V14<=Vorgaben!$D$12,\"x\",\"\")","v":""},"x","","",{"$f":"IF(ROW(AA11)>COUNTA(AA:AA),\"\",INDEX(AA:AA,SMALL(IF(AA$1:AA$29<>\"\",ROW($1:$29)),ROW($AA11))))","v":{"$error":"#NUM!"}},""]
["DRS",125,"DRS125",null,null,null,{"$f":"Auslegung!$D$32","v":550},50,150,125,{"$f":"Auslegung!$D$32/(PI()/4*(Grunddaten!J15/1000)^2*3600)","v":12.44945332629937},{"$f":"SUM('DAL359-CAP'!$C$40,'DAL358-CAP'!$C$40,'DRS-CAP'!$C$40,'DIA-CAP'!$C$40,'MSA-CAP'!$C$40)*Grunddaten!G15^(SUM('DAL359-CAP'!$C$41,'DAL358-CAP'!$C$41,'DRS-CAP'!$C$41,'DIA-CAP'!$C$41,'MSA-CAP'!$C$41))","v":12.08859461409336},{"$f":"SUM('DAL359-CAP'!$C$68,'DAL358-CAP'!$C$68,'DRS-CAP'!$C$68,'DIA-CAP'!$C$68,'MSA-CAP'!$C$68)*Grunddaten!G15^(SUM('DAL359-CAP'!$C$69,'DAL358-CAP'!$C$69,'DRS-CAP'!$C$69,'DIA-CAP'!$C$69,'MSA-CAP'!$C$69))","v":0},207,148,620,185,{"$f":"IF(Vorgaben!$D$8/Vorgaben!$D$9>=Grunddaten!$H15,\"x\",\"\")","v":"x"},{"$f":"IF(Vorgaben!$D$8/Vorgaben!$D$9<=Grunddaten!$I15,\"x\",\"\")","v":""},-84.65,56.22,{"$f":"T15+U15*LOG(Vorgaben!$D$8/Vorgaben!$D$9)","v":69.413190403366372},"x",{"$f":"IF(V15<=Vorgaben!$D$12,\"x\",\"\")","v":""},"x","","",{"$f":"IF(ROW(AA12)>COUNTA(AA:AA),\"\",INDEX(AA:AA,SMALL(IF(AA$1:AA$29<>\"\",ROW($1:$29)),ROW($AA12))))","v":{"$error":"#NUM!"}},""]
["DRS",180,"DRS180",null,null,null,{"$f":"Auslegung!$D$32","v":550},100,275,180,{"$f":"Auslegung!$D$32/(PI()/4*(Grunddaten!J16/1000)^2*3600)","v":6.0037872908465326},{"$f":"SUM('DAL359-CAP'!$C$40,'DAL358-CAP'!$C$40,'DRS-CAP'!$C$40,'DIA-CAP'!$C$40,'MSA-CAP'!$C$40)*Grunddaten!G16^(SUM('DAL359-CAP'!$C$41,'DAL358-CAP'!$C$41,'DRS-CAP'!$C$41,'DIA-CAP'!$C$41,'MSA-CAP'!$C$41))","v":12.08859461409336},{"$f":"SUM('DAL359-CAP'!$C$68,'DAL358-CAP'!$C$68,'DRS-CAP'!$C$68,'DIA-CAP'!$C$68,'MSA-CAP'!$C$68)*Grunddaten!G16^(SUM('DAL359-CAP'!$C$69,'DAL358-CAP'!$C$69,'DRS-CAP'!$C$69,'DIA-CAP'!$C$69,'MSA-CAP'!$C$69))","v":0},252,231,620,280,{"$f":"IF(Vorgaben!$D$8/Vorgaben!$D$9>=Grunddaten!$H16,\"x\",\"\")","v":"x"},{"$f":"IF(Vorgaben!$D$8/Vorgaben!$D$9<=Grunddaten!$I16,\"x\",\"\")","v":""},-124.9,67.27,{"$f":"T16+U16*LOG(Vorgaben!$D$8/Vorgaben!$D$9)","v":59.444198122277754},"x",{"$f":"IF(V16<=Vorgaben!$D$12,\"x\",\"\")","v":""},"x","","",{"$f":"IF(ROW(AA13)>COUNTA(AA:AA),\"\",INDEX(AA:AA,SMALL(IF(AA$1:AA$29<>\"\",ROW($1:$29)),ROW($AA13))))","v":{"$error":"#NUM!"}},""]
["DRS",250,"DRS250",null,null,null,{"$f":"Auslegung!$D$32","v":550},150,450,250,{"$f":"Auslegung!$D$32/(PI()/4*(Grunddaten!J17/1000)^2*3600)","v":3.1123633315748425},{"$f":"SUM('DAL359-CAP'!$C$40,'DAL358-CAP'!$C$40,'DRS-CAP'!$C$40,'DIA-CAP'!$C$40,'MSA-CAP'!$C$40)*Grunddaten!G17^(SUM('DAL359-CAP'!$C$41,'DAL358-CAP'!$C$41,'DRS-CAP'!$C$41,'DIA-CAP'!$C$41,'MSA-CAP'!$C$41))","v":12.08859461409336},{"$f":"SUM('DAL359-CAP'!$C$68,'DAL358-CAP'!$C$68,'DRS-CAP'!$C$68,'DIA-CAP'!$C$68,'MSA-CAP'!$C$68)*Grunddaten!G17^(SUM('DAL359-CAP'!$C$69,'DAL358-CAP'!$C$69,'DRS-CAP'!$C$69,'DIA-CAP'!$C$69,'MSA-CAP'!$C$69))","v":0},302,316,620,380,{"$f":"IF(Vorgaben!$D$8/Vorgaben!$D$9>=Grunddaten!$H17,\"x\",\"\")","v":"x"},{"$f":"IF(Vorgaben!$D$8/Vorgaben!$D$9<=Grunddaten!$I17,\"x\",\"\")","v":""},-125,60.59,{"$f":"T17+U17*LOG(Vorgaben!$D$8/Vorgaben!$D$9)","v":41.038575356456221},"x",{"$f":"IF(V17<=Vorgaben!$D$12,\"x\",\"\")","v":""},"x","","",{"$f":"IF(ROW(AA14)>COUNTA(AA:AA),\"\",INDEX(AA:AA,SMALL(IF(AA$1:AA$29<>\"\",ROW($1:$29)),ROW($AA14))))","v":{"$error":"#NUM!"}},""]
["DRS",315,"DRS315",null,null,null,{"$f":"Auslegung!$D$32","v":550},225,725,315,{"$f":"Auslegung!$D$32/(PI()/4*(Grunddaten!J18/1000)^2*3600)","v":1.9604203398682551},{"$f":"SUM('DAL359-CAP'!$C$40,'DAL358-CAP'!$C$40,'DRS-CAP'!$C$40,'DIA-CAP'!$C$40,'MSA-CAP'!$C$40)*Grunddaten!G18^(SUM('DAL359-CAP'!$C$41,'DAL358-CAP'!$C$41,'DRS-CAP'!$C$41,'DIA-CAP'!$C$41,'MSA-CAP'!$C$41))","v":12.08859461409336},{"$f":"SUM('DAL359-CAP'!$C$68,'DAL358-CAP'!$C$68,'DRS-CAP'!$C$68,'DIA-CAP'!$C$68,'MSA-CAP'!$C$68)*Grunddaten!G18^(SUM('DAL359-CAP'!$C$69,'DAL358-CAP'!$C$69,'DRS-CAP'!$C$69,'DIA-CAP'!$C$69,'MSA-CAP'!$C$69))","v":0},367,405,620,490,{"$f":"IF(Vorgaben!$D$8/Vorgaben!$D$9>=Grunddaten!$H18,\"x\",\"\")","v":"x"},{"$f":"IF(Vorgaben!$D$8/Vorgaben!$D$9<=Grunddaten!$I18,\"x\",\"\")","v":"x"},-131.80000000000001,59.05,{"$f":"T18+U18*LOG(Vorgaben!$D$8/Vorgaben!$D$9)","v":30.01841681463506},"x",{"$f":"IF(V18<=Vorgaben!$D$12,\"x\",\"\")","v":"x"},"x","x","DRS DN 315",{"$f":"IF(ROW(AA15)>COUNTA(AA:AA),\"\",INDEX(AA:AA,SMALL(IF(AA$1:AA$29<>\"\",ROW($1:$29)),ROW($AA15))))","v":{"$error":"#NUM!"}},""]
["DRS",355,"DRS355",null,null,null,{"$f":"Auslegung!$D$32","v":550},350,925,355,{"$f":"Auslegung!$D$32/(PI()/4*(Grunddaten!J19/1000)^2*3600)","v":1.5435247627330104},{"$f":"SUM('DAL359-CAP'!$C$40,'DAL358-CAP'!$C$40,'DRS-CAP'!$C$40,'DIA-CAP'!$C$40,'MSA-CAP'!$C$40)*Grunddaten!G19^(SUM('DAL359-CAP'!$C$41,'DAL358-CAP'!$C$41,'DRS-CAP'!$C$41,'DIA-CAP'!$C$41,'MSA-CAP'!$C$41))","v":12.08859461409336},{"$f":"SUM('DAL359-CAP'!$C$68,'DAL358-CAP'!$C$68,'DRS-CAP'!$C$68,'DIA-CAP'!$C$68,'MSA-CAP'!$C$68)*Grunddaten!G19^(SUM('DAL359-CAP'!$C$69,'DAL358-CAP'!$C$69,'DRS-CAP'!$C$69,'DIA-CAP'!$C$69,'MSA-CAP'!$C$69))","v":0},402,453,620,550,{"$f":"IF(Vorgaben!$D$8/Vorgaben!$D$9>=Grunddaten!$H19,\"x\",\"\")","v":"x"},{"$f":"IF(Vorgaben!$D$8/Vorgaben!$D$9<=Grunddaten!$I19,\"x\",\"\")","v":"x"},-140,59.15,{"$f":"T19+U19*LOG(Vorgaben!$D$8/Vorgaben!$D$9)","v":22.092453083584502},"x",{"$f":"IF(V19<=Vorgaben!$D$12,\"x\",\"\")","v":"x"},"x","x","DRS DN 355",{"$f":"IF(ROW(AA16)>COUNTA(AA:AA),\"\",INDEX(AA:AA,SMALL(IF(AA$1:AA$29<>\"\",ROW($1:$29)),ROW($AA16))))","v":{"$error":"#NUM!"}},""]
["DIA",100,"DIA100",null,null,null,{"$f":"Auslegung!$D$32","v":550},25,100,100,{"$f":"Auslegung!$D$32/(PI()/4*(Grunddaten!J20/1000)^2*3600)","v":19.452270822342761},{"$f":"(SUM('DAL359-CAP'!$C$40,'DAL358-CAP'!$C$40,'DRS-CAP'!$C$40,'DIA-CAP'!$C$40,'MSA-CAP'!$C$40)*Grunddaten!G20^(SUM('DAL359-CAP'!$C$41,'DAL358-CAP'!$C$41,'DRS-CAP'!$C$41,'DIA-CAP'!$C$41,'MSA-CAP'!$C$41)))*1.1","v":13.297454075502698},{"$f":"SUM('DAL359-CAP'!$C$68,'DAL358-CAP'!$C$68,'DRS-CAP'!$C$68,'DIA-CAP'!$C$68,'MSA-CAP'!$C$68)*Grunddaten!G20^(SUM('DAL359-CAP'!$C$69,'DAL358-CAP'!$C$69,'DRS-CAP'!$C$69,'DIA-CAP'!$C$69,'MSA-CAP'!$C$69))","v":0},177,122,620,155,{"$f":"IF(Vorgaben!$D$8/Vorgaben!$D$9>=Grunddaten!$H20,\"x\",\"\")","v":"x"},{"$f":"IF(Vorgaben!$D$8/Vorgaben!$D$9<=Grunddaten!$I20,\"x\",\"\")","v":""},-60.68,49.43,{"$f":"T20+U20*LOG(Vorgaben!$D$8/Vorgaben!$D$9)","v":74.776127741700464},"x",{"$f":"IF(V20<=Vorgaben!$D$12,\"x\",\"\")","v":""},"gesperrt","","",{"$f":"IF(ROW(AA17)>COUNTA(AA:AA),\"\",INDEX(AA:AA,SMALL(IF(AA$1:AA$29<>\"\",ROW($1:$29)),ROW($AA17))))","v":{"$error":"#NUM!"}},""]
["DIA",125,"DIA125",null,null,null,{"$f":"Auslegung!$D$32","v":550},50,150,125,{"$f":"Auslegung!$D$32/(PI()/4*(Grunddaten!J21/1000)^2*3600)","v":12.44945332629937},{"$f":"(SUM('DAL359-CAP'!$C$40,'DAL358-CAP'!$C$40,'DRS-CAP'!$C$40,'DIA-CAP'!$C$40,'MSA-CAP'!$C$40)*Grunddaten!G21^(SUM('DAL359-CAP'!$C$41,'DAL358-CAP'!$C$41,'DRS-CAP'!$C$41,'DIA-CAP'!$C$41,'MSA-CAP'!$C$41)))*1.1","v":13.297454075502698},{"$f":"SUM('DAL359-CAP'!$C$68,'DAL358-CAP'!$C$68,'DRS-CAP'!$C$68,'DIA-CAP'!$C$68,'MSA-CAP'!$C$68)*Grunddaten!G21^(SUM('DAL359-CAP'!$C$69,'DAL358-CAP'!$C$69,'DRS-CAP'!$C$69,'DIA-CAP'!$C$69,'MSA-CAP'!$C$69))","v":0},207,148,620,185,{"$f":"IF(Vorgaben!$D$8/Vorgaben!$D$9>=Grunddaten!$H21,\"x\",\"\")","v":"x"},{"$f":"IF(Vorgaben!$D$8/Vorgaben!$D$9<=Grunddaten!$I21,\"x\",\"\")","v":""},-82.15,56.22,{"$f":"T21+U21*LOG(Vorgaben!$D$8/Vorgaben!$D$9)","v":71.913190403366372},"x",{"$f":"IF(V21<=Vorgaben!$D$12,\"x\",\"\")","v":""},"gesperrt","","",{"$f":"IF(ROW(AA18)>COUNTA(AA:AA),\"\",INDEX(AA:AA,SMALL(IF(AA$1:AA$29<>\"\",ROW($1:$29)),ROW($AA18))))","v":{"$error":"#NUM!"}},""]
["DIA",180,"DIA180",null,null,null,{"$f":"Auslegung!$D$32","v":550},100,275,180,{"$f":"Auslegung!$D$32/(PI()/4*(Grunddaten!J22/1000)^2*3600)","v":6.0037872908465326},{"$f":"(SUM('DAL359-CAP'!$C$40,'DAL358-CAP'!$C$40,'DRS-CAP'!$C$40,'DIA-CAP'!$C$40,'MSA-CAP'!$C$40)*Grunddaten!G22^(SUM('DAL359-CAP'!$C$41,'DAL358-CAP'!$C$41,'DRS-CAP'!$C$41,'DIA-CAP'!$C$41,'MSA-CAP'!$C$41)))*1.1","v":13.297454075502698},{"$f":"SUM('DAL359-CAP'!$C$68,'DAL358-CAP'!$C$68,'DRS-CAP'!$C$68,'DIA-CAP'!$C$68,'MSA-CAP'!$C$68)*Grunddaten!G22^(SUM('DAL359-CAP'!$C$69,'DAL358-CAP'!$C$69,'DRS-CAP'!$C$69,'DIA-CAP'!$C$69,'MSA-CAP'!$C$69))","v":0},252,231,620,280,{"$f":"IF(Vorgaben!$D$8/Vorgaben!$D$9>=Grunddaten!$H22,\"x\",\"\")","v":"x"},{"$f":"IF(Vorgaben!$D$8/Vorgaben!$D$9<=Grunddaten!$I22,\"x\",\"\")","v":""},-122.4,67.27,{"$f":"T22+U22*LOG(Vorgaben!$D$8/Vorgaben!$D$9)","v":61.944198122277754},"x",{"$f":"IF(V22<=Vorgaben!$D$12,\"x\",\"\")","v":""},"gesperrt","","",{"$f":"IF(ROW(AA19)>COUNTA(AA:AA),\"\",INDEX(AA:AA,SMALL(IF(AA$1:AA$29<>\"\",ROW($1:$29)),ROW($AA19))))","v":{"$error":"#NUM!"}},""]
["DIA",250,"DIA250",null,null,null,{"$f":"Auslegung!$D$32","v":550},150,450,250,{"$f":"Auslegung!$D$32/(PI()/4*(Grunddaten!J23/1000)^2*3600)","v":3.1123633315748425},{"$f":"(SUM('DAL359-CAP'!$C$40,'DAL358-CAP'!$C$40,'DRS-CAP'!$C$40,'DIA-CAP'!$C$40,'MSA-CAP'!$C$40)*Grunddaten!G23^(SUM('DAL359-CAP'!$C$41,'DAL358-CAP'!$C$41,'DRS-CAP'!$C$41,'DIA-CAP'!$C$41,'MSA-CAP'!$C$41)))*1.1","v":13.297454075502698},{"$f":"SUM('DAL359-CAP'!$C$68,'DAL358-CAP'!$C$68,'DRS-CAP'!$C$68,'DIA-CAP'!$C$68,'MSA-CAP'!$C$68)*Grunddaten!G23^(SUM('DAL359-CAP'!$C$69,'DAL358-CAP'!$C$69,'DRS-CAP'!$C$69,'DIA-CAP'!$C$69,'MSA-CAP'!$C$69))","v":0},302,316,620,380,{"$f":"IF(Vorgaben!$D$8/Vorgaben!$D$9>=Grunddaten!$H23,\"x\",\"\")","v":"x"},{"$f":"IF(Vorgaben!$D$8/Vorgaben!$D$9<=Grunddaten!$I23,\"x\",\"\")","v":""},-122.5,60.59,{"$f":"T23+U23*LOG(Vorgaben!$D$8/Vorgaben!$D$9)","v":43.538575356456221},"x",{"$f":"IF(V23<=Vorgaben!$D$12,\"x\",\"\")","v":""},"gesperrt","","",{"$f":"IF(ROW(AA20)>COUNTA(AA:AA),\"\",INDEX(AA:AA,SMALL(IF(AA$1:AA$29<>\"\",ROW($1:$29)),ROW($AA20))))","v":{"$error":"#NUM!"}},""]
["DIA",315,"DIA315",null,null,null,{"$f":"Auslegung!$D$32","v":550},225,725,315,{"$f":"Auslegung!$D$32/(PI()/4*(Grunddaten!J24/1000)^2*3600)","v":1.9604203398682551},{"$f":"(SUM('DAL359-CAP'!$C$40,'DAL358-CAP'!$C$40,'DRS-CAP'!$C$40,'DIA-CAP'!$C$40,'MSA-CAP'!$C$40)*Grunddaten!G24^(SUM('DAL359-CAP'!$C$41,'DAL358-CAP'!$C$41,'DRS-CAP'!$C$41,'DIA-CAP'!$C$41,'MSA-CAP'!$C$41)))*1.1","v":13.297454075502698},{"$f":"SUM('DAL359-CAP'!$C$68,'DAL358-CAP'!$C$68,'DRS-CAP'!$C$68,'DIA-CAP'!$C$68,'MSA-CAP'!$C$68)*Grunddaten!G24^(SUM('DAL359-CAP'!$C$69,'DAL358-CAP'!$C$69,'DRS-CAP'!$C$69,'DIA-CAP'!$C$69,'MSA-CAP'!$C$69))","v":0},367,405,620,490,{"$f":"IF(Vorgaben!$D$8/Vorgaben!$D$9>=Grunddaten!$H24,\"x\",\"\")","v":"x"},{"$f":"IF(Vorgaben!$D$8/Vorgaben!$D$9<=Grunddaten!$I24,\"x\",\"\")","v":"x"},-129.30000000000001,59.05,{"$f":"T24+U24*LOG(Vorgaben!$D$8/Vorgaben!$D$9)","v":32.51841681463506},"x",{"$f":"IF(V24<=Vorgaben!$D$12,\"x\",\"\")","v":"x"},"gesperrt","","",{"$f":"IF(ROW(AA21)>COUNTA(AA:AA),\"\",INDEX(AA:AA,SMALL(IF(AA$1:AA$29<>\"\",ROW($1:$29)),ROW($AA21))))","v":{"$error":"#NUM!"}},""]
["DIA",355,"DIA355",null,null,null,{"$f":"Auslegung!$D$32","v":550},350,950,355,{"$f":"Auslegung!$D$32/(PI()/4*(Grunddaten!J25/1000)^2*3600)","v":1.5435247627330104},{"$f":"(SUM('DAL359-CAP'!$C$40,'DAL358-CAP'!$C$40,'DRS-CAP'!$C$40,'DIA-CAP'!$C$40,'MSA-CAP'!$C$40)*Grunddaten!G25^(SUM('DAL359-CAP'!$C$41,'DAL358-CAP'!$C$41,'DRS-CAP'!$C$41,'DIA-CAP'!$C$41,'MSA-CAP'!$C$41)))*1.1","v":13.297454075502698},{"$f":"SUM('DAL359-CAP'!$C$68,'DAL358-CAP'!$C$68,'DRS-CAP'!$C$68,'DIA-CAP'!$C$68,'MSA-CAP'!$C$68)*Grunddaten!G25^(SUM('DAL359-CAP'!$C$69,'DAL358-CAP'!$C$69,'DRS-CAP'!$C$69,'DIA-CAP'!$C$69,'MSA-CAP'!$C$69))","v":0},402,453,620,550,{"$f":"IF(Vorgaben!$D$8/Vorgaben!$D$9>=Grunddaten!$H25,\"x\",\"\")","v":"x"},{"$f":"IF(Vorgaben!$D$8/Vorgaben!$D$9<=Grunddaten!$I25,\"x\",\"\")","v":"x"},-137.5,59.15,{"$f":"T25+U25*LOG(Vorgaben!$D$8/Vorgaben!$D$9)","v":24.592453083584502},"x",{"$f":"IF(V25<=Vorgaben!$D$12,\"x\",\"\")","v":"x"},"gesperrt","","",{"$f":"IF(ROW(AA22)>COUNTA(AA:AA),\"\",INDEX(AA:AA,SMALL(IF(AA$1:AA$29<>\"\",ROW($1:$29)),ROW($AA22))))","v":{"$error":"#NUM!"}},""]
["MSA",300,"MSA300",null,null,null,{"$f":"Auslegung!$D$32","v":550},75,600,160,{"$f":"Auslegung!$D$32/(PI()/4*(Grunddaten!J26/1000)^2*3600)","v":7.5985432899776422},{"$f":"SUM('DAL359-CAP'!$C$40,'DAL358-CAP'!$C$40,'DRS-CAP'!$C$40,'DIA-CAP'!$C$40,'MSA-CAP'!$C$40)*Grunddaten!G26^(SUM('DAL359-CAP'!$C$41,'DAL358-CAP'!$C$41,'DRS-CAP'!$C$41,'DIA-CAP'!$C$41,'MSA-CAP'!$C$41))","v":12.08859461409336},{"$f":"SUM('DAL359-CAP'!$C$68,'DAL358-CAP'!$C$68,'DRS-CAP'!$C$68,'DIA-CAP'!$C$68,'MSA-CAP'!$C$68)*Grunddaten!G26^(SUM('DAL359-CAP'!$C$69,'DAL358-CAP'!$C$69,'DRS-CAP'!$C$69,'DIA-CAP'!$C$69,'MSA-CAP'!$C$69))","v":0},275,292,298,{"$f":"\"-/-\"","v":"-/-"},{"$f":"IF(Vorgaben!$D$8/Vorgaben!$D$9>=Grunddaten!$H26,\"x\",\"\")","v":"x"},{"$f":"IF(Vorgaben!$D$8/Vorgaben!$D$9<=Grunddaten!$I26,\"x\",\"\")","v":"x"},-102.89108412925144,60.560770981134887,{"$f":"T26+U26*LOG(Vorgaben!$D$8/Vorgaben!$D$9)","v":63.067393114456294},"x",{"$f":"IF(V26<=Vorgaben!$D$12,\"x\",\"\")","v":""},"x","","",{"$f":"IF(ROW(AA23)>COUNTA(AA:AA),\"\",INDEX(AA:AA,SMALL(IF(AA$1:AA$29<>\"\",ROW($1:$29)),ROW($AA23))))","v":{"$error":"#NUM!"}},""]
["MSA",400,"MSA400",null,null,null,{"$f":"Auslegung!$D$32","v":550},130,700,200,{"$f":"Auslegung!$D$32/(PI()/4*(Grunddaten!J27/1000)^2*3600)","v":4.8630677055856903},{"$f":"SUM('DAL359-CAP'!$C$40,'DAL358-CAP'!$C$40,'DRS-CAP'!$C$40,'DIA-CAP'!$C$40,'MSA-CAP'!$C$40)*Grunddaten!G27^(SUM('DAL359-CAP'!$C$41,'DAL358-CAP'!$C$41,'DRS-CAP'!$C$41,'DIA-CAP'!$C$41,'MSA-CAP'!$C$41))","v":12.08859461409336},{"$f":"SUM('DAL359-CAP'!$C$68,'DAL358-CAP'!$C$68,'DRS-CAP'!$C$68,'DIA-CAP'!$C$68,'MSA-CAP'!$C$68)*Grunddaten!G27^(SUM('DAL359-CAP'!$C$69,'DAL358-CAP'!$C$69,'DRS-CAP'!$C$69,'DIA-CAP'!$C$69,'MSA-CAP'!$C$69))","v":0},315,392,398,{"$f":"\"-/-\"","v":"-/-"},{"$f":"IF(Vorgaben!$D$8/Vorgaben!$D$9>=Grunddaten!$H27,\"x\",\"\")","v":"x"},{"$f":"IF(Vorgaben!$D$8/Vorgaben!$D$9<=Grunddaten!$I27,\"x\",\"\")","v":"x"},-124.04972114709894,65.35058245929325,{"$f":"T27+U27*LOG(Vorgaben!$D$8/Vorgaben!$D$9)","v":55.034576761065253},"x",{"$f":"IF(V27<=Vorgaben!$D$12,\"x\",\"\")","v":""},"x","","",{"$f":"IF(ROW(AA24)>COUNTA(AA:AA),\"\",INDEX(AA:AA,SMALL(IF(AA$1:AA$29<>\"\",ROW($1:$29)),ROW($AA24))))","v":{"$error":"#NUM!"}},""]
["MSA",500,"MSA500",null,null,null,{"$f":"Auslegung!$D$32","v":550},200,800,225,{"$f":"Auslegung!$D$32/(PI()/4*(Grunddaten!J28/1000)^2*3600)","v":3.8424238661417802},{"$f":"SUM('DAL359-CAP'!$C$40,'DAL358-CAP'!$C$40,'DRS-CAP'!$C$40,'DIA-CAP'!$C$40,'MSA-CAP'!$C$40)*Grunddaten!G28^(SUM('DAL359-CAP'!$C$41,'DAL358-CAP'!$C$41,'DRS-CAP'!$C$41,'DIA-CAP'!$C$41,'MSA-CAP'!$C$41))","v":12.08859461409336},{"$f":"SUM('DAL359-CAP'!$C$68,'DAL358-CAP'!$C$68,'DRS-CAP'!$C$68,'DIA-CAP'!$C$68,'MSA-CAP'!$C$68)*Grunddaten!G28^(SUM('DAL359-CAP'!$C$69,'DAL358-CAP'!$C$69,'DRS-CAP'!$C$69,'DIA-CAP'!$C$69,'MSA-CAP'!$C$69))","v":0},340,492,498,"-/-",{"$f":"IF(Vorgaben!$D$8/Vorgaben!$D$9>=Grunddaten!$H28,\"x\",\"\")","v":"x"},{"$f":"IF(Vorgaben!$D$8/Vorgaben!$D$9<=Grunddaten!$I28,\"x\",\"\")","v":"x"},-116.91527170898351,56.589666454135127,{"$f":"T28+U28*LOG(Vorgaben!$D$8/Vorgaben!$D$9)","v":38.160938852852411},"x",{"$f":"IF(V28<=Vorgaben!$D$12,\"x\",\"\")","v":""},"x","","",{"$f":"IF(ROW(AA25)>COUNTA(AA:AA),\"\",INDEX(AA:AA,SMALL(IF(AA$1:AA$29<>\"\",ROW($1:$29)),ROW($AA25))))","v":{"$error":"#NUM!"}},""]
["MSA",600,"MSA600",null,null,null,{"$f":"Auslegung!$D$32","v":550},300,1000,250,{"$f":"Auslegung!$D$32/(PI()/4*(Grunddaten!J29/1000)^2*3600)","v":3.1123633315748425},{"$f":"SUM('DAL359-CAP'!$C$40,'DAL358-CAP'!$C$40,'DRS-CAP'!$C$40,'DIA-CAP'!$C$40,'MSA-CAP'!$C$40)*Grunddaten!G29^(SUM('DAL359-CAP'!$C$41,'DAL358-CAP'!$C$41,'DRS-CAP'!$C$41,'DIA-CAP'!$C$41,'MSA-CAP'!$C$41))","v":12.08859461409336},{"$f":"SUM('DAL359-CAP'!$C$68,'DAL358-CAP'!$C$68,'DRS-CAP'!$C$68,'DIA-CAP'!$C$68,'MSA-CAP'!$C$68)*Grunddaten!G29^(SUM('DAL359-CAP'!$C$69,'DAL358-CAP'!$C$69,'DRS-CAP'!$C$69,'DIA-CAP'!$C$69,'MSA-CAP'!$C$69))","v":0},365,614,595,"-/-",{"$f":"IF(Vorgaben!$D$8/Vorgaben!$D$9>=Grunddaten!$H29,\"x\",\"\")","v":"x"},{"$f":"IF(Vorgaben!$D$8/Vorgaben!$D$9<=Grunddaten!$I29,\"x\",\"\")","v":"x"},-140.78516782633633,62.432981117219406,{"$f":"T29+U29*LOG(Vorgaben!$D$8/Vorgaben!$D$9)","v":30.30384422119036},"x",{"$f":"IF(V29<=Vorgaben!$D$12,\"x\",\"\")","v":"x"},"x","x","MSA DN 600",{"$f":"IF(ROW(AA26)>COUNTA(AA:AA),\"\",INDEX(AA:AA,SMALL(IF(AA$1:AA$29<>\"\",ROW($1:$29)),ROW($AA26))))","v":{"$error":"#NUM!"}},""]
[null,null,null,null,null,null,null,null,null,null,null,null,null,null,null,null,null,null,null,null,null,null,null,null,null,null,null,{"$f":"IF(ROW(AA27)>COUNTA(AA:AA),\"\",INDEX(AA:AA,SMALL(IF(AA$1:AA$29<>\"\",ROW($1:$29)),ROW($AA27))))","v":""}]
[null,null,null,2,3,4,5,6,7,8,9,10,11,12,13,14,15,16,17,18,19,20,null,21,null,22,null,{"$f":"IF(ROW(AA28)>COUNTA(AA:AA),\"\",INDEX(AA:AA,SMALL(IF(AA$1:AA$29<>\"\",ROW($1:$29)),ROW($AA28))))","v":""}]
[null,null,null,null,null,null,null,null,null,null,null,null,null,null,null,null,null,null,null,null,null,null,null,null,null,null,null,"Formel in Spalte AB ist Matrixformel!"]
["Auswahl:","Zuluft",{"$f":"CONCATENATE(Auslegung!$D$12,Auslegung!$D$25)","v":"DAL 358800"},{"$f":"VLOOKUP($C$33,$C$4:$L$30,D31,FALSE)","v":0},0,0,550,400,1750,{"$f":"VLOOKUP($C$33,$C$4:$L$30,J31,FALSE)","v":315},1.9604203398682551,{"$f":"VLOOKUP($C$33,$C$4:$L$30,L31,FALSE)","v":12.08859461409336},{"$f":"VLOOKUP($C$33,$C$4:$M$30,M31,FALSE)","v":0},{"$f":"VLOOKUP($C$33,$C$4:$N$30,N31,FALSE)","v":430},{"$f":"VLOOKUP($C$33,$C$4:$Q$30,O31,FALSE)","v":794},{"$f":"VLOOKUP($C$33,$C$4:$Q$30,P31,FALSE)","v":800},{"$f":"VLOOKUP($C$33,$C$4:$Q$30,Q31,FALSE)","v":800},{"$f":"VLOOKUP($C$33,$C$4:$R$30,R31,FALSE)","v":"x"},{"$f":"VLOOKUP($C$33,$C$4:$Z$30,S31,FALSE)","v":"x"},{"$f":"VLOOKUP($C$33,$C$4:$Z$30,T31,FALSE)","v":-141.4},{"$f":"VLOOKUP($C$33,$C$4:$Z$30,U31,FALSE)","v":62.47},{"$f":"VLOOKUP($C$33,$C$4:$Z$30,V31,FALSE)","v":29.790457212705405},null,{"$f":"VLOOKUP($C$33,$C$4:$Z$30,X31,FALSE)","v":"x"},null,{"$f":"VLOOKUP($C$33,$C$4:$Z$30,Z31,FALSE)","v":"x"},null,"Funktioniert nur bei Bestätigung"]
[null,"Abluft",{"$f":"CONCATENATE(Auslegung!$D$12,Auslegung!$D$25)","v":"DAL 358800"},{"$f":"VLOOKUP($C$34,$C$4:$L$30,D31,FALSE)","v":0},0,0,550,400,1750,315,1.9604203398682551,{"$f":"VLOOKUP($C$34,$C$4:$L$30,L31,FALSE)","v":12.08859461409336},{"$f":"VLOOKUP($C$33,$C$4:$M$30,M31,FALSE)","v":0},{"$f":"VLOOKUP($C$34,$C$4:$N$30,N31,FALSE)","v":430},{"$f":"VLOOKUP($C$34,$C$4:$Q$30,O31,FALSE)","v":794},{"$f":"VLOOKUP($C$34,$C$4:$Q$30,P31,FALSE)","v":800},{"$f":"VLOOKUP($C$34,$C$4:$Q$30,Q31,FALSE)","v":800},{"$f":"VLOOKUP($C$34,$C$4:$R$30,R31,FALSE)","v":"x"},null,null,null,null,null,null,null,null,null,"mit Strg+Shift+Enter!"]
[]
[null,null,null,"Stand:","2020-10-30",null,null,null,null,null,null,null,null,"Abmessungen DRS und DIA mit AK-rund aus CAP!"]
[]
[]
["Blendengröße",null,300,400,500,600,625,800]
["mögl. Lochbild",null,100,100,100,100,100,100]
[null,null,125,125,125,125,125,125]
[null,null,180,180,180,180,180,180]
[null,null,null,250,250,250,250,250]
[null,null,null,null,315,315,315,315]
[null,null,null,null,null,355,355,355]
[]
["Blendengröße",null,300,400,500,600,625,800]
[null,null,300,300,300,300,300,300]
[null,null,null,400,400,400,400,400]
[null,null,null,null,500,500,500,500]
[null,null,null,null,null,600,600,600]
[null,null,null,null,null,null,null,800]

{"sheet":"Lw","index":8,"n_rows":149,"n_cols":23,"rows_kept":149,"cut":false,"hidden":true,"merged":[[131,0,131,1],[54,1,54,7],[1,1,1,21],[21,1,21,21],[123,0,123,2],[124,0,124,1],[125,0,125,1],[126,0,126,1],[127,0,127,1],[128,0,128,1],[129,0,129,1],[130,0,130,1],[3,0,18,0],[93,1,93,7],[143,0,143,1],[132,0,132,1],[133,0,133,1],[134,0,134,1],[135,0,135,1],[136,0,136,1],[137,0,137,1],[138,0,138,1],[139,0,139,1],[140,0,140,1],[141,0,141,1],[142,0,142,1],[148,0,148,1],[144,0,144,1],[145,0,145,1],[146,0,146,1],[147,0,147,1]]}
[]
[null,"Terzfrequenzband fm [Hz]"]
[null,100,125,160,200,250,315,400,500,630,800,1000,1250,1600,2000,2500,3150,4000,5000,6300,8000,10000]
["Konstantensätze bei Bedarf aktualisieren und Vergleich der unterschiedlichen Berechnungsarten anstellen! Klassische CAP-Berechnung wird unten durchgeführt."]
[]
[]
[]
[]
[]
[]
[]
[]
[]
[]
[]
[]
[]
[]
[]
[null,2,3,4,5,6,7,8,9,10,11,12,13,14,15,16,17,18,19,20,21,22]
[]
[null,"Terzfrequenzband fm [Hz]"]
[null,100,125,160,200,250,315,400,500,630,800,1000,1250,1600,2000,2500,3150,4000,5000,6300,8000,10000]
[{"$f":"Grunddaten!C4","v":"DAL 359300"},{"$f":"B$4+Lw!B$5*LOG(Grunddaten!$G4)+B$6*LOG(Grunddaten!$F4)+B$7*LOG(Grunddaten!$H4)","v":{"$error":"#NUM!"}},{"$f":"C$4+C$5*LOG(Grunddaten!$G4)+C$6*LOG(Grunddaten!$F4)+C$7*LOG(Grunddaten!$H4)","v":{"$error":"#NUM!"}},{"$f":"D$4+D$5*LOG(Grunddaten!$G4)+D$6*LOG(Grunddaten!$F4)+D$7*LOG(Grunddaten!$H4)","v":{"$error":"#NUM!"}},{"$f":"E$4+E$5*LOG(Grunddaten!$G4)+E$6*LOG(Grunddaten!$F4)+E$7*LOG(Grunddaten!$H4)","v":{"$error":"#NUM!"}},{"$f":"F$4+F$5*LOG(Grunddaten!$G4)+F$6*LOG(Grunddaten!$F4)+F$7*LOG(Grunddaten!$H4)","v":{"$error":"#NUM!"}},{"$f":"G$4+G$5*LOG(Grunddaten!$G4)+G$6*LOG(Grunddaten!$F4)+G$7*LOG(Grunddaten!$H4)","v":{"$error":"#NUM!"}},{"$f":"H$4+H$5*LOG(Grunddaten!$G4)+H$6*LOG(Grunddaten!$F4)+H$7*LOG(Grunddaten!$H4)","v":{"$error":"#NUM!"}},{"$f":"I$4+I$5*LOG(Grunddaten!$G4)+I$6*LOG(Grunddaten!$F4)+I$7*LOG(Grunddaten!$H4)","v":{"$error":"#NUM!"}},{"$f":"J$4+J$5*LOG(Grunddaten!$G4)+J$6*LOG(Grunddaten!$F4)+J$7*LOG(Grunddaten!$H4)","v":{"$error":"#NUM!"}},{"$f":"K$4+K$5*LOG(Grunddaten!$G4)+K$6*LOG(Grunddaten!$F4)+K$7*LOG(Grunddaten!$H4)","v":{"$error":"#NUM!"}},{"$f":"L$4+L$5*LOG(Grunddaten!$G4)+L$6*LOG(Grunddaten!$F4)+L$7*LOG(Grunddaten!$H4)","v":{"$error":"#NUM!"}},{"$f":"M$4+M$5*LOG(Grunddaten!$G4)+M$6*LOG(Grunddaten!$F4)+M$7*LOG(Grunddaten!$H4)","v":{"$error":"#NUM!"}},{"$f":"N$4+N$5*LOG(Grunddaten!$G4)+N$6*LOG(Grunddaten!$F4)+N$7*LOG(Grunddaten!$H4)","v":{"$error":"#NUM!"}},{"$f":"O$4+O$5*LOG(Grunddaten!$G4)+O$6*LOG(Grunddaten!$F4)+O$7*LOG(Grunddaten!$H4)","v":{"$error":"#NUM!"}},{"$f":"P$4+P$5*LOG(Grunddaten!$G4)+P$6*LOG(Grunddaten!$F4)+P$7*LOG(Grunddaten!$H4)","v":{"$error":"#NUM!"}},{"$f":"Q$4+Q$5*LOG(Grunddaten!$G4)+Q$6*LOG(Grunddaten!$F4)+Q$7*LOG(Grunddaten!$H4)","v":{"$error":"#NUM!"}},{"$f":"R$4+R$5*LOG(Grunddaten!$G4)+R$6*LOG(Grunddaten!$F4)+R$7*LOG(Grunddaten!$H4)","v":{"$error":"#NUM!"}},{"$f":"S$4+S$5*LOG(Grunddaten!$G4)+S$6*LOG(Grunddaten!$F4)+S$7*LOG(Grunddaten!$H4)","v":{"$error":"#NUM!"}},{"$f":"T$4+T$5*LOG(Grunddaten!$G4)+T$6*LOG(Grunddaten!$F4)+T$7*LOG(Grunddaten!$H4)","v":{"$error":"#NUM!"}},{"$f":"U$4+U$5*LOG(Grunddaten!$G4)+U$6*LOG(Grunddaten!$F4)+U$7*LOG(Grunddaten!$H4)","v":{"$error":"#NUM!"}},{"$f":"V$4+V$5*LOG(Grunddaten!$G4)+V$6*LOG(Grunddaten!$F4)+V$7*LOG(Grunddaten!$H4)","v":{"$error":"#NUM!"}},{"$f":"10*LOG(10^(0.1*B24)+10^(0.1*C24)+10^(0.1*D24)+10^(0.1*E24)+10^(0.1*F24)+10^(0.1*G24)+10^(0.1*H24)+10^(0.1*I24)+10^(0.1*J24)+10^(0.1*K24)+10^(0.1*L24)+10^(0.1*M24)+10^(0.1*N24)+10^(0.1*O24)+10^(0.1*P24)+10^(0.1*Q24)+10^(0.1*R24)+10^(0.1*S24)+10^(0.1*T24)+10^(0.1*U24)+10^(0.1*V24))","v":{"$error":"#NUM!"}}]
[{"$f":"Grunddaten!C5","v":"DAL 359400"},{"$f":"B$4+B$5*LOG(Grunddaten!$G5)+B$6*LOG(Grunddaten!$F5)+B$7*LOG(Grunddaten!$H5)","v":{"$error":"#NUM!"}},{"$f":"C$4+C$5*LOG(Grunddaten!$G5)+C$6*LOG(Grunddaten!$F5)+C$7*LOG(Grunddaten!$H5)","v":{"$error":"#NUM!"}},{"$f":"D$4+D$5*LOG(Grunddaten!$G5)+D$6*LOG(Grunddaten!$F5)+D$7*LOG(Grunddaten!$H5)","v":{"$error":"#NUM!"}},{"$f":"E$4+E$5*LOG(Grunddaten!$G5)+E$6*LOG(Grunddaten!$F5)+E$7*LOG(Grunddaten!$H5)","v":{"$error":"#NUM!"}},{"$f":"F$4+F$5*LOG(Grunddaten!$G5)+F$6*LOG(Grunddaten!$F5)+F$7*LOG(Grunddaten!$H5)","v":{"$error":"#NUM!"}},{"$f":"G$4+G$5*LOG(Grunddaten!$G5)+G$6*LOG(Grunddaten!$F5)+G$7*LOG(Grunddaten!$H5)","v":{"$error":"#NUM!"}},{"$f":"H$4+H$5*LOG(Grunddaten!$G5)+H$6*LOG(Grunddaten!$F5)+H$7*LOG(Grunddaten!$H5)","v":{"$error":"#NUM!"}},{"$f":"I$4+I$5*LOG(Grunddaten!$G5)+I$6*LOG(Grunddaten!$F5)+I$7*LOG(Grunddaten!$H5)","v":{"$error":"#NUM!"}},{"$f":"J$4+J$5*LOG(Grunddaten!$G5)+J$6*LOG(Grunddaten!$F5)+J$7*LOG(Grunddaten!$H5)","v":{"$error":"#NUM!"}},{"$f":"K$4+K$5*LOG(Grunddaten!$G5)+K$6*LOG(Grunddaten!$F5)+K$7*LOG(Grunddaten!$H5)","v":{"$error":"#NUM!"}},{"$f":"L$4+L$5*LOG(Grunddaten!$G5)+L$6*LOG(Grunddaten!$F5)+L$7*LOG(Grunddaten!$H5)","v":{"$error":"#NUM!"}},{"$f":"M$4+M$5*LOG(Grunddaten!$G5)+M$6*LOG(Grunddaten!$F5)+M$7*LOG(Grunddaten!$H5)","v":{"$error":"#NUM!"}},{"$f":"N$4+N$5*LOG(Grunddaten!$G5)+N$6*LOG(Grunddaten!$F5)+N$7*LOG(Grunddaten!$H5)","v":{"$error":"#NUM!"}},{"$f":"O$4+O$5*LOG(Grunddaten!$G5)+O$6*LOG(Grunddaten!$F5)+O$7*LOG(Grunddaten!$H5)","v":{"$error":"#NUM!"}},{"$f":"P$4+P$5*LOG(Grunddaten!$G5)+P$6*LOG(Grunddaten!$F5)+P$7*LOG(Grunddaten!$H5)","v":{"$error":"#NUM!"}},{"$f":"Q$4+Q$5*LOG(Grunddaten!$G5)+Q$6*LOG(Grunddaten!$F5)+Q$7*LOG(Grunddaten!$H5)","v":{"$error":"#NUM!"}},{"$f":"R$4+R$5*LOG(Grunddaten!$G5)+R$6*LOG(Grunddaten!$F5)+R$7*LOG(Grunddaten!$H5)","v":{"$error":"#NUM!"}},{"$f":"S$4+S$5*LOG(Grunddaten!$G5)+S$6*LOG(Grunddaten!$F5)+S$7*LOG(Grunddaten!$H5)","v":{"$error":"#NUM!"}},{"$f":"T$4+T$5*LOG(Grunddaten!$G5)+T$6*LOG(Grunddaten!$F5)+T$7*LOG(Grunddaten!$H5)","v":{"$error":"#NUM!"}},{"$f":"U$4+U$5*LOG(Grunddaten!$G5)+U$6*LOG(Grunddaten!$F5)+U$7*LOG(Grunddaten!$H5)","v":{"$error":"#NUM!"}},{"$f":"V$4+V$5*LOG(Grunddaten!$G5)+V$6*LOG(Grunddaten!$F5)+V$7*LOG(Grunddaten!$H5)","v":{"$error":"#NUM!"}},{"$f":"10*LOG(10^(0.1*B25)+10^(0.1*C25)+10^(0.1*D25)+10^(0.1*E25)+10^(0.1*F25)+10^(0.1*G25)+10^(0.1*H25)+10^(0.1*I25)+10^(0.1*J25)+10^(0.1*K25)+10^(0.1*L25)+10^(0.1*M25)+10^(0.1*N25)+10^(0.1*O25)+10^(0.1*P25)+10^(0.1*Q25)+10^(0.1*R25)+10^(0.1*S25)+10^(0.1*T25)+10^(0.1*U25)+10^(0.1*V25))","v":{"$error":"#NUM!"}}]
[{"$f":"Grunddaten!C6","v":"DAL 359500"},{"$f":"B$4+B$5*LOG(Grunddaten!$G6)+B$6*LOG(Grunddaten!$F6)+B$7*LOG(Grunddaten!$H6)","v":{"$error":"#NUM!"}},{"$f":"C$4+C$5*LOG(Grunddaten!$G6)+C$6*LOG(Grunddaten!$F6)+C$7*LOG(Grunddaten!$H6)","v":{"$error":"#NUM!"}},{"$f":"D$4+D$5*LOG(Grunddaten!$G6)+D$6*LOG(Grunddaten!$F6)+D$7*LOG(Grunddaten!$H6)","v":{"$error":"#NUM!"}},{"$f":"E$4+E$5*LOG(Grunddaten!$G6)+E$6*LOG(Grunddaten!$F6)+E$7*LOG(Grunddaten!$H6)","v":{"$error":"#NUM!"}},{"$f":"F$4+F$5*LOG(Grunddaten!$G6)+F$6*LOG(Grunddaten!$F6)+F$7*LOG(Grunddaten!$H6)","v":{"$error":"#NUM!"}},{"$f":"G$4+G$5*LOG(Grunddaten!$G6)+G$6*LOG(Grunddaten!$F6)+G$7*LOG(Grunddaten!$H6)","v":{"$error":"#NUM!"}},{"$f":"H$4+H$5*LOG(Grunddaten!$G6)+H$6*LOG(Grunddaten!$F6)+H$7*LOG(Grunddaten!$H6)","v":{"$error":"#NUM!"}},{"$f":"I$4+I$5*LOG(Grunddaten!$G6)+I$6*LOG(Grunddaten!$F6)+I$7*LOG(Grunddaten!$H6)","v":{"$error":"#NUM!"}},{"$f":"J$4+J$5*LOG(Grunddaten!$G6)+J$6*LOG(Grunddaten!$F6)+J$7*LOG(Grunddaten!$H6)","v":{"$error":"#NUM!"}},{"$f":"K$4+K$5*LOG(Grunddaten!$G6)+K$6*LOG(Grunddaten!$F6)+K$7*LOG(Grunddaten!$H6)","v":{"$error":"#NUM!"}},{"$f":"L$4+L$5*LOG(Grunddaten!$G6)+L$6*LOG(Grunddaten!$F6)+L$7*LOG(Grunddaten!$H6)","v":{"$error":"#NUM!"}},{"$f":"M$4+M$5*LOG(Grunddaten!$G6)+M$6*LOG(Grunddaten!$F6)+M$7*LOG(Grunddaten!$H6)","v":{"$error":"#NUM!"}},{"$f":"N$4+N$5*LOG(Grunddaten!$G6)+N$6*LOG(Grunddaten!$F6)+N$7*LOG(Grunddaten!$H6)","v":{"$error":"#NUM!"}},{"$f":"O$4+O$5*LOG(Grunddaten!$G6)+O$6*LOG(Grunddaten!$F6)+O$7*LOG(Grunddaten!$H6)","v":{"$error":"#NUM!"}},{"$f":"P$4+P$5*LOG(Grunddaten!$G6)+P$6*LOG(Grunddaten!$F6)+P$7*LOG(Grunddaten!$H6)","v":{"$error":"#NUM!"}},{"$f":"Q$4+Q$5*LOG(Grunddaten!$G6)+Q$6*LOG(Grunddaten!$F6)+Q$7*LOG(Grunddaten!$H6)","v":{"$error":"#NUM!"}},{"$f":"R$4+R$5*LOG(Grunddaten!$G6)+R$6*LOG(Grunddaten!$F6)+R$7*LOG(Grunddaten!$H6)","v":{"$error":"#NUM!"}},{"$f":"S$4+S$5*LOG(Grunddaten!$G6)+S$6*LOG(Grunddaten!$F6)+S$7*LOG(Grunddaten!$H6)","v":{"$error":"#NUM!"}},{"$f":"T$4+T$5*LOG(Grunddaten!$G6)+T$6*LOG(Grunddaten!$F6)+T$7*LOG(Grunddaten!$H6)","v":{"$error":"#NUM!"}},{"$f":"U$4+U$5*LOG(Grunddaten!$G6)+U$6*LOG(Grunddaten!$F6)+U$7*LOG(Grunddaten!$H6)","v":{"$error":"#NUM!"}},{"$f":"V$4+V$5*LOG(Grunddaten!$G6)+V$6*LOG(Grunddaten!$F6)+V$7*LOG(Grunddaten!$H6)","v":{"$error":"#NUM!"}},{"$f":"10*LOG(10^(0.1*B26)+10^(0.1*C26)+10^(0.1*D26)+10^(0.1*E26)+10^(0.1*F26)+10^(0.1*G26)+10^(0.1*H26)+10^(0.1*I26)+10^(0.1*J26)+10^(0.1*K26)+10^(0.1*L26)+10^(0.1*M26)+10^(0.1*N26)+10^(0.1*O26)+10^(0.1*P26)+10^(0.1*Q26)+10^(0.1*R26)+10^(0.1*S26)+10^(0.1*T26)+10^(0.1*U26)+10^(0.1*V26))","v":{"$error":"#NUM!"}}]
[{"$f":"Grunddaten!C7","v":"DAL 359600"},{"$f":"B$4+B$5*LOG(Grunddaten!$G7)+B$6*LOG(Grunddaten!$F7)+B$7*LOG(Grunddaten!$H7)","v":{"$error":"#NUM!"}},{"$f":"C$4+C$5*LOG(Grunddaten!$G7)+C$6*LOG(Grunddaten!$F7)+C$7*LOG(Grunddaten!$H7)","v":{"$error":"#NUM!"}},{"$f":"D$4+D$5*LOG(Grunddaten!$G7)+D$6*LOG(Grunddaten!$F7)+D$7*LOG(Grunddaten!$H7)","v":{"$error":"#NUM!"}},{"$f":"E$4+E$5*LOG(Grunddaten!$G7)+E$6*LOG(Grunddaten!$F7)+E$7*LOG(Grunddaten!$H7)","v":{"$error":"#NUM!"}},{"$f":"F$4+F$5*LOG(Grunddaten!$G7)+F$6*LOG(Grunddaten!$F7)+F$7*LOG(Grunddaten!$H7)","v":{"$error":"#NUM!"}},{"$f":"G$4+G$5*LOG(Grunddaten!$G7)+G$6*LOG(Grunddaten!$F7)+G$7*LOG(Grunddaten!$H7)","v":{"$error":"#NUM!"}},{"$f":"H$4+H$5*LOG(Grunddaten!$G7)+H$6*LOG(Grunddaten!$F7)+H$7*LOG(Grunddaten!$H7)","v":{"$error":"#NUM!"}},{"$f":"I$4+I$5*LOG(Grunddaten!$G7)+I$6*LOG(Grunddaten!$F7)+I$7*LOG(Grunddaten!$H7)","v":{"$error":"#NUM!"}},{"$f":"J$4+J$5*LOG(Grunddaten!$G7)+J$6*LOG(Grunddaten!$F7)+J$7*LOG(Grunddaten!$H7)","v":{"$error":"#NUM!"}},{"$f":"K$4+K$5*LOG(Grunddaten!$G7)+K$6*LOG(Grunddaten!$F7)+K$7*LOG(Grunddaten!$H7)","v":{"$error":"#NUM!"}},{"$f":"L$4+L$5*LOG(Grunddaten!$G7)+L$6*LOG(Grunddaten!$F7)+L$7*LOG(Grunddaten!$H7)","v":{"$error":"#NUM!"}},{"$f":"M$4+M$5*LOG(Grunddaten!$G7)+M$6*LOG(Grunddaten!$F7)+M$7*LOG(Grunddaten!$H7)","v":{"$error":"#NUM!"}},{"$f":"N$4+N$5*LOG(Grunddaten!$G7)+N$6*LOG(Grunddaten!$F7)+N$7*LOG(Grunddaten!$H7)","v":{"$error":"#NUM!"}},{"$f":"O$4+O$5*LOG(Grunddaten!$G7)+O$6*LOG(Grunddaten!$F7)+O$7*LOG(Grunddaten!$H7)","v":{"$error":"#NUM!"}},{"$f":"P$4+P$5*LOG(Grunddaten!$G7)+P$6*LOG(Grunddaten!$F7)+P$7*LOG(Grunddaten!$H7)","v":{"$error":"#NUM!"}},{"$f":"Q$4+Q$5*LOG(Grunddaten!$G7)+Q$6*LOG(Grunddaten!$F7)+Q$7*LOG(Grunddaten!$H7)","v":{"$error":"#NUM!"}},{"$f":"R$4+R$5*LOG(Grunddaten!$G7)+R$6*LOG(Grunddaten!$F7)+R$7*LOG(Grunddaten!$H7)","v":{"$error":"#NUM!"}},{"$f":"S$4+S$5*LOG(Grunddaten!$G7)+S$6*LOG(Grunddaten!$F7)+S$7*LOG(Grunddaten!$H7)","v":{"$error":"#NUM!"}},{"$f":"T$4+T$5*LOG(Grunddaten!$G7)+T$6*LOG(Grunddaten!$F7)+T$7*LOG(Grunddaten!$H7)","v":{"$error":"#NUM!"}},{"$f":"U$4+U$5*LOG(Grunddaten!$G7)+U$6*LOG(Grunddaten!$F7)+U$7*LOG(Grunddaten!$H7)","v":{"$error":"#NUM!"}},{"$f":"V$4+V$5*LOG(Grunddaten!$G7)+V$6*LOG(Grunddaten!$F7)+V$7*LOG(Grunddaten!$H7)","v":{"$error":"#NUM!"}},{"$f":"10*LOG(10^(0.1*B27)+10^(0.1*C27)+10^(0.1*D27)+10^(0.1*E27)+10^(0.1*F27)+10^(0.1*G27)+10^(0.1*H27)+10^(0.1*I27)+10^(0.1*J27)+10^(0.1*K27)+10^(0.1*L27)+10^(0.1*M27)+10^(0.1*N27)+10^(0.1*O27)+10^(0.1*P27)+10^(0.1*Q27)+10^(0.1*R27)+10^(0.1*S27)+10^(0.1*T27)+10^(0.1*U27)+10^(0.1*V27))","v":{"$error":"#NUM!"}}]
[{"$f":"Grunddaten!C8","v":"DAL 359800"},{"$f":"B$8+B$9*LOG(Grunddaten!$G8)+B$10*LOG(Grunddaten!$F8)+B$11*LOG(Grunddaten!$H8)","v":{"$error":"#NUM!"}},{"$f":"C$8+C$9*LOG(Grunddaten!$G8)+C$10*LOG(Grunddaten!$F8)+C$11*LOG(Grunddaten!$H8)","v":{"$error":"#NUM!"}},{"$f":"D$8+D$9*LOG(Grunddaten!$G8)+D$10*LOG(Grunddaten!$F8)+D$11*LOG(Grunddaten!$H8)","v":{"$error":"#NUM!"}},{"$f":"E$8+E$9*LOG(Grunddaten!$G8)+E$10*LOG(Grunddaten!$F8)+E$11*LOG(Grunddaten!$H8)","v":{"$error":"#NUM!"}},{"$f":"F$8+F$9*LOG(Grunddaten!$G8)+F$10*LOG(Grunddaten!$F8)+F$11*LOG(Grunddaten!$H8)","v":{"$error":"#NUM!"}},{"$f":"G$8+G$9*LOG(Grunddaten!$G8)+G$10*LOG(Grunddaten!$F8)+G$11*LOG(Grunddaten!$H8)","v":{"$error":"#NUM!"}},{"$f":"H$8+H$9*LOG(Grunddaten!$G8)+H$10*LOG(Grunddaten!$F8)+H$11*LOG(Grunddaten!$H8)","v":{"$error":"#NUM!"}},{"$f":"I$8+I$9*LOG(Grunddaten!$G8)+I$10*LOG(Grunddaten!$F8)+I$11*LOG(Grunddaten!$H8)","v":{"$error":"#NUM!"}},{"$f":"J$8+J$9*LOG(Grunddaten!$G8)+J$10*LOG(Grunddaten!$F8)+J$11*LOG(Grunddaten!$H8)","v":{"$error":"#NUM!"}},{"$f":"K$8+K$9*LOG(Grunddaten!$G8)+K$10*LOG(Grunddaten!$F8)+K$11*LOG(Grunddaten!$H8)","v":{"$error":"#NUM!"}},{"$f":"L$8+L$9*LOG(Grunddaten!$G8)+L$10*LOG(Grunddaten!$F8)+L$11*LOG(Grunddaten!$H8)","v":{"$error":"#NUM!"}},{"$f":"M$8+M$9*LOG(Grunddaten!$G8)+M$10*LOG(Grunddaten!$F8)+M$11*LOG(Grunddaten!$H8)","v":{"$error":"#NUM!"}},{"$f":"N$8+N$9*LOG(Grunddaten!$G8)+N$10*LOG(Grunddaten!$F8)+N$11*LOG(Grunddaten!$H8)","v":{"$error":"#NUM!"}},{"$f":"O$8+O$9*LOG(Grunddaten!$G8)+O$10*LOG(Grunddaten!$F8)+O$11*LOG(Grunddaten!$H8)","v":{"$error":"#NUM!"}},{"$f":"P$8+P$9*LOG(Grunddaten!$G8)+P$10*LOG(Grunddaten!$F8)+P$11*LOG(Grunddaten!$H8)","v":{"$error":"#NUM!"}},{"$f":"Q$8+Q$9*LOG(Grunddaten!$G8)+Q$10*LOG(Grunddaten!$F8)+Q$11*LOG(Grunddaten!$H8)","v":{"$error":"#NUM!"}},{"$f":"R$8+R$9*LOG(Grunddaten!$G8)+R$10*LOG(Grunddaten!$F8)+R$11*LOG(Grunddaten!$H8)","v":{"$error":"#NUM!"}},{"$f":"S$8+S$9*LOG(Grunddaten!$G8)+S$10*LOG(Grunddaten!$F8)+S$11*LOG(Grunddaten!$H8)","v":{"$error":"#NUM!"}},{"$f":"T$8+T$9*LOG(Grunddaten!$G8)+T$10*LOG(Grunddaten!$F8)+T$11*LOG(Grunddaten!$H8)","v":{"$error":"#NUM!"}},{"$f":"U$8+U$9*LOG(Grunddaten!$G8)+U$10*LOG(Grunddaten!$F8)+U$11*LOG(Grunddaten!$H8)","v":{"$error":"#NUM!"}},{"$f":"V$8+V$9*LOG(Grunddaten!$G8)+V$10*LOG(Grunddaten!$F8)+V$11*LOG(Grunddaten!$H8)","v":{"$error":"#NUM!"}},{"$f":"10*LOG(10^(0.1*B28)+10^(0.1*C28)+10^(0.1*D28)+10^(0.1*E28)+10^(0.1*F28)+10^(0.1*G28)+10^(0.1*H28)+10^(0.1*I28)+10^(0.1*J28)+10^(0.1*K28)+10^(0.1*L28)+10^(0.1*M28)+10^(0.1*N28)+10^(0.1*O28)+10^(0.1*P28)+10^(0.1*Q28)+10^(0.1*R28)+10^(0.1*S28)+10^(0.1*T28)+10^(0.1*U28)+10^(0.1*V28))","v":{"$error":"#NUM!"}}]
[{"$f":"Grunddaten!C9","v":"DAL 358300"},{"$f":"B$8+B$9*LOG(Grunddaten!$G9)+B$10*LOG(Grunddaten!$F9)+B$11*LOG(Grunddaten!$H9)","v":{"$error":"#NUM!"}},{"$f":"C$8+C$9*LOG(Grunddaten!$G9)+C$10*LOG(Grunddaten!$F9)+C$11*LOG(Grunddaten!$H9)","v":{"$error":"#NUM!"}},{"$f":"D$8+D$9*LOG(Grunddaten!$G9)+D$10*LOG(Grunddaten!$F9)+D$11*LOG(Grunddaten!$H9)","v":{"$error":"#NUM!"}},{"$f":"E$8+E$9*LOG(Grunddaten!$G9)+E$10*LOG(Grunddaten!$F9)+E$11*LOG(Grunddaten!$H9)","v":{"$error":"#NUM!"}},{"$f":"F$8+F$9*LOG(Grunddaten!$G9)+F$10*LOG(Grunddaten!$F9)+F$11*LOG(Grunddaten!$H9)","v":{"$error":"#NUM!"}},{"$f":"G$8+G$9*LOG(Grunddaten!$G9)+G$10*LOG(Grunddaten!$F9)+G$11*LOG(Grunddaten!$H9)","v":{"$error":"#NUM!"}},{"$f":"H$8+H$9*LOG(Grunddaten!$G9)+H$10*LOG(Grunddaten!$F9)+H$11*LOG(Grunddaten!$H9)","v":{"$error":"#NUM!"}},{"$f":"I$8+I$9*LOG(Grunddaten!$G9)+I$10*LOG(Grunddaten!$F9)+I$11*LOG(Grunddaten!$H9)","v":{"$error":"#NUM!"}},{"$f":"J$8+J$9*LOG(Grunddaten!$G9)+J$10*LOG(Grunddaten!$F9)+J$11*LOG(Grunddaten!$H9)","v":{"$error":"#NUM!"}},{"$f":"K$8+K$9*LOG(Grunddaten!$G9)+K$10*LOG(Grunddaten!$F9)+K$11*LOG(Grunddaten!$H9)","v":{"$error":"#NUM!"}},{"$f":"L$8+L$9*LOG(Grunddaten!$G9)+L$10*LOG(Grunddaten!$F9)+L$11*LOG(Grunddaten!$H9)","v":{"$error":"#NUM!"}},{"$f":"M$8+M$9*LOG(Grunddaten!$G9)+M$10*LOG(Grunddaten!$F9)+M$11*LOG(Grunddaten!$H9)","v":{"$error":"#NUM!"}},{"$f":"N$8+N$9*LOG(Grunddaten!$G9)+N$10*LOG(Grunddaten!$F9)+N$11*LOG(Grunddaten!$H9)","v":{"$error":"#NUM!"}},{"$f":"O$8+O$9*LOG(Grunddaten!$G9)+O$10*LOG(Grunddaten!$F9)+O$11*LOG(Grunddaten!$H9)","v":{"$error":"#NUM!"}},{"$f":"P$8+P$9*LOG(Grunddaten!$G9)+P$10*LOG(Grunddaten!$F9)+P$11*LOG(Grunddaten!$H9)","v":{"$error":"#NUM!"}},{"$f":"Q$8+Q$9*LOG(Grunddaten!$G9)+Q$10*LOG(Grunddaten!$F9)+Q$11*LOG(Grunddaten!$H9)","v":{"$error":"#NUM!"}},{"$f":"R$8+R$9*LOG(Grunddaten!$G9)+R$10*LOG(Grunddaten!$F9)+R$11*LOG(Grunddaten!$H9)","v":{"$error":"#NUM!"}},{"$f":"S$8+S$9*LOG(Grunddaten!$G9)+S$10*LOG(Grunddaten!$F9)+S$11*LOG(Grunddaten!$H9)","v":{"$error":"#NUM!"}},{"$f":"T$8+T$9*LOG(Grunddaten!$G9)+T$10*LOG(Grunddaten!$F9)+T$11*LOG(Grunddaten!$H9)","v":{"$error":"#NUM!"}},{"$f":"U$8+U$9*LOG(Grunddaten!$G9)+U$10*LOG(Grunddaten!$F9)+U$11*LOG(Grunddaten!$H9)","v":{"$error":"#NUM!"}},{"$f":"V$8+V$9*LOG(Grunddaten!$G9)+V$10*LOG(Grunddaten!$F9)+V$11*LOG(Grunddaten!$H9)","v":{"$error":"#NUM!"}},{"$error":"#NUM!"}]
[{"$f":"Grunddaten!C10","v":"DAL 358400"},{"$f":"B$8+B$9*LOG(Grunddaten!$G10)+B$10*LOG(Grunddaten!$F10)+B$11*LOG(Grunddaten!$H10)","v":{"$error":"#NUM!"}},{"$f":"C$8+C$9*LOG(Grunddaten!$G10)+C$10*LOG(Grunddaten!$F10)+C$11*LOG(Grunddaten!$H10)","v":{"$error":"#NUM!"}},{"$f":"D$8+D$9*LOG(Grunddaten!$G10)+D$10*LOG(Grunddaten!$F10)+D$11*LOG(Grunddaten!$H10)","v":{"$error":"#NUM!"}},{"$f":"E$8+E$9*LOG(Grunddaten!$G10)+E$10*LOG(Grunddaten!$F10)+E$11*LOG(Grunddaten!$H10)","v":{"$error":"#NUM!"}},{"$f":"F$8+F$9*LOG(Grunddaten!$G10)+F$10*LOG(Grunddaten!$F10)+F$11*LOG(Grunddaten!$H10)","v":{"$error":"#NUM!"}},{"$f":"G$8+G$9*LOG(Grunddaten!$G10)+G$10*LOG(Grunddaten!$F10)+G$11*LOG(Grunddaten!$H10)","v":{"$error":"#NUM!"}},{"$f":"H$8+H$9*LOG(Grunddaten!$G10)+H$10*LOG(Grunddaten!$F10)+H$11*LOG(Grunddaten!$H10)","v":{"$error":"#NUM!"}},{"$f":"I$8+I$9*LOG(Grunddaten!$G10)+I$10*LOG(Grunddaten!$F10)+I$11*LOG(Grunddaten!$H10)","v":{"$error":"#NUM!"}},{"$f":"J$8+J$9*LOG(Grunddaten!$G10)+J$10*LOG(Grunddaten!$F10)+J$11*LOG(Grunddaten!$H10)","v":{"$error":"#NUM!"}},{"$f":"K$8+K$9*LOG(Grunddaten!$G10)+K$10*LOG(Grunddaten!$F10)+K$11*LOG(Grunddaten!$H10)","v":{"$error":"#NUM!"}},{"$f":"L$8+L$9*LOG(Grunddaten!$G10)+L$10*LOG(Grunddaten!$F10)+L$11*LOG(Grunddaten!$H10)","v":{"$error":"#NUM!"}},{"$f":"M$8+M$9*LOG(Grunddaten!$G10)+M$10*LOG(Grunddaten!$F10)+M$11*LOG(Grunddaten!$H10)","v":{"$error":"#NUM!"}},{"$f":"N$8+N$9*LOG(Grunddaten!$G10)+N$10*LOG(Grunddaten!$F10)+N$11*LOG(Grunddaten!$H10)","v":{"$error":"#NUM!"}},{"$f":"O$8+O$9*LOG(Grunddaten!$G10)+O$10*LOG(Grunddaten!$F10)+O$11*LOG(Grunddaten!$H10)","v":{"$error":"#NUM!"}},{"$f":"P$8+P$9*LOG(Grunddaten!$G10)+P$10*LOG(Grunddaten!$F10)+P$11*LOG(Grunddaten!$H10)","v":{"$error":"#NUM!"}},{"$f":"Q$8+Q$9*LOG(Grunddaten!$G10)+Q$10*LOG(Grunddaten!$F10)+Q$11*LOG(Grunddaten!$H10)","v":{"$error":"#NUM!"}},{"$f":"R$8+R$9*LOG(Grunddaten!$G10)+R$10*LOG(Grunddaten!$F10)+R$11*LOG(Grunddaten!$H10)","v":{"$error":"#NUM!"}},{"$f":"S$8+S$9*LOG(Grunddaten!$G10)+S$10*LOG(Grunddaten!$F10)+S$11*LOG(Grunddaten!$H10)","v":{"$error":"#NUM!"}},{"$f":"T$8+T$9*LOG(Grunddaten!$G10)+T$10*LOG(Grunddaten!$F10)+T$11*LOG(Grunddaten!$H10)","v":{"$error":"#NUM!"}},{"$f":"U$8+U$9*LOG(Grunddaten!$G10)+U$10*LOG(Grunddaten!$F10)+U$11*LOG(Grunddaten!$H10)","v":{"$error":"#NUM!"}},{"$f":"V$8+V$9*LOG(Grunddaten!$G10)+V$10*LOG(Grunddaten!$F10)+V$11*LOG(Grunddaten!$H10)","v":{"$error":"#NUM!"}},{"$error":"#NUM!"}]
[{"$f":"Grunddaten!C11","v":"DAL 358500"},{"$f":"B$8+B$9*LOG(Grunddaten!$G11)+B$10*LOG(Grunddaten!$F11)+B$11*LOG(Grunddaten!$H11)","v":{"$error":"#NUM!"}},{"$f":"C$8+C$9*LOG(Grunddaten!$G11)+C$10*LOG(Grunddaten!$F11)+C$11*LOG(Grunddaten!$H11)","v":{"$error":"#NUM!"}},{"$f":"D$8+D$9*LOG(Grunddaten!$G11)+D$10*LOG(Grunddaten!$F11)+D$11*LOG(Grunddaten!$H11)","v":{"$error":"#NUM!"}},{"$f":"E$8+E$9*LOG(Grunddaten!$G11)+E$10*LOG(Grunddaten!$F11)+E$11*LOG(Grunddaten!$H11)","v":{"$error":"#NUM!"}},{"$f":"F$8+F$9*LOG(Grunddaten!$G11)+F$10*LOG(Grunddaten!$F11)+F$11*LOG(Grunddaten!$H11)","v":{"$error":"#NUM!"}},{"$f":"G$8+G$9*LOG(Grunddaten!$G11)+G$10*LOG(Grunddaten!$F11)+G$11*LOG(Grunddaten!$H11)","v":{"$error":"#NUM!"}},{"$f":"H$8+H$9*LOG(Grunddaten!$G11)+H$10*LOG(Grunddaten!$F11)+H$11*LOG(Grunddaten!$H11)","v":{"$error":"#NUM!"}},{"$f":"I$8+I$9*LOG(Grunddaten!$G11)+I$10*LOG(Grunddaten!$F11)+I$11*LOG(Grunddaten!$H11)","v":{"$error":"#NUM!"}},{"$f":"J$8+J$9*LOG(Grunddaten!$G11)+J$10*LOG(Grunddaten!$F11)+J$11*LOG(Grunddaten!$H11)","v":{"$error":"#NUM!"}},{"$f":"K$8+K$9*LOG(Grunddaten!$G11)+K$10*LOG(Grunddaten!$F11)+K$11*LOG(Grunddaten!$H11)","v":{"$error":"#NUM!"}},{"$f":"L$8+L$9*LOG(Grunddaten!$G11)+L$10*LOG(Grunddaten!$F11)+L$11*LOG(Grunddaten!$H11)","v":{"$error":"#NUM!"}},{"$f":"M$8+M$9*LOG(Grunddaten!$G11)+M$10*LOG(Grunddaten!$F11)+M$11*LOG(Grunddaten!$H11)","v":{"$error":"#NUM!"}},{"$f":"N$8+N$9*LOG(Grunddaten!$G11)+N$10*LOG(Grunddaten!$F11)+N$11*LOG(Grunddaten!$H11)","v":{"$error":"#NUM!"}},{"$f":"O$8+O$9*LOG(Grunddaten!$G11)+O$10*LOG(Grunddaten!$F11)+O$11*LOG(Grunddaten!$H11)","v":{"$error":"#NUM!"}},{"$f":"P$8+P$9*LOG(Grunddaten!$G11)+P$10*LOG(Grunddaten!$F11)+P$11*LOG(Grunddaten!$H11)","v":{"$error":"#NUM!"}},{"$f":"Q$8+Q$9*LOG(Grunddaten!$G11)+Q$10*LOG(Grunddaten!$F11)+Q$11*LOG(Grunddaten!$H11)","v":{"$error":"#NUM!"}},{"$f":"R$8+R$9*LOG(Grunddaten!$G11)+R$10*LOG(Grunddaten!$F11)+R$11*LOG(Grunddaten!$H11)","v":{"$error":"#NUM!"}},{"$f":"S$8+S$9*LOG(Grunddaten!$G11)+S$10*LOG(Grunddaten!$F11)+S$11*LOG(Grunddaten!$H11)","v":{"$error":"#NUM!"}},{"$f":"T$8+T$9*LOG(Grunddaten!$G11)+T$10*LOG(Grunddaten!$F11)+T$11*LOG(Grunddaten!$H11)","v":{"$error":"#NUM!"}},{"$f":"U$8+U$9*LOG(Grunddaten!$G11)+U$10*LOG(Grunddaten!$F11)+U$11*LOG(Grunddaten!$H11)","v":{"$error":"#NUM!"}},{"$f":"V$8+V$9*LOG(Grunddaten!$G11)+V$10*LOG(Grunddaten!$F11)+V$11*LOG(Grunddaten!$H11)","v":{"$error":"#NUM!"}},{"$error":"#NUM!"}]
[{"$f":"Grunddaten!C12","v":"DAL 358600"},{"$f":"B$8+B$9*LOG(Grunddaten!$G12)+B$10*LOG(Grunddaten!$F12)+B$11*LOG(Grunddaten!$H12)","v":{"$error":"#NUM!"}},{"$f":"C$8+C$9*LOG(Grunddaten!$G12)+C$10*LOG(Grunddaten!$F12)+C$11*LOG(Grunddaten!$H12)","v":{"$error":"#NUM!"}},{"$f":"D$8+D$9*LOG(Grunddaten!$G12)+D$10*LOG(Grunddaten!$F12)+D$11*LOG(Grunddaten!$H12)","v":{"$error":"#NUM!"}},{"$f":"E$8+E$9*LOG(Grunddaten!$G12)+E$10*LOG(Grunddaten!$F12)+E$11*LOG(Grunddaten!$H12)","v":{"$error":"#NUM!"}},{"$f":"F$8+F$9*LOG(Grunddaten!$G12)+F$10*LOG(Grunddaten!$F12)+F$11*LOG(Grunddaten!$H12)","v":{"$error":"#NUM!"}},{"$f":"G$8+G$9*LOG(Grunddaten!$G12)+G$10*LOG(Grunddaten!$F12)+G$11*LOG(Grunddaten!$H12)","v":{"$error":"#NUM!"}},{"$f":"H$8+H$9*LOG(Grunddaten!$G12)+H$10*LOG(Grunddaten!$F12)+H$11*LOG(Grunddaten!$H12)","v":{"$error":"#NUM!"}},{"$f":"I$8+I$9*LOG(Grunddaten!$G12)+I$10*LOG(Grunddaten!$F12)+I$11*LOG(Grunddaten!$H12)","v":{"$error":"#NUM!"}},{"$f":"J$8+J$9*LOG(Grunddaten!$G12)+J$10*LOG(Grunddaten!$F12)+J$11*LOG(Grunddaten!$H12)","v":{"$error":"#NUM!"}},{"$f":"K$8+K$9*LOG(Grunddaten!$G12)+K$10*LOG(Grunddaten!$F12)+K$11*LOG(Grunddaten!$H12)","v":{"$error":"#NUM!"}},{"$f":"L$8+L$9*LOG(Grunddaten!$G12)+L$10*LOG(Grunddaten!$F12)+L$11*LOG(Grunddaten!$H12)","v":{"$error":"#NUM!"}},{"$f":"M$8+M$9*LOG(Grunddaten!$G12)+M$10*LOG(Grunddaten!$F12)+M$11*LOG(Grunddaten!$H12)","v":{"$error":"#NUM!"}},{"$f":"N$8+N$9*LOG(Grunddaten!$G12)+N$10*LOG(Grunddaten!$F12)+N$11*LOG(Grunddaten!$H12)","v":{"$error":"#NUM!"}},{"$f":"O$8+O$9*LOG(Grunddaten!$G12)+O$10*LOG(Grunddaten!$F12)+O$11*LOG(Grunddaten!$H12)","v":{"$error":"#NUM!"}},{"$f":"P$8+P$9*LOG(Grunddaten!$G12)+P$10*LOG(Grunddaten!$F12)+P$11*LOG(Grunddaten!$H12)","v":{"$error":"#NUM!"}},{"$f":"Q$8+Q$9*LOG(Grunddaten!$G12)+Q$10*LOG(Grunddaten!$F12)+Q$11*LOG(Grunddaten!$H12)","v":{"$error":"#NUM!"}},{"$f":"R$8+R$9*LOG(Grunddaten!$G12)+R$10*LOG(Grunddaten!$F12)+R$11*LOG(Grunddaten!$H12)","v":{"$error":"#NUM!"}},{"$f":"S$8+S$9*LOG(Grunddaten!$G12)+S$10*LOG(Grunddaten!$F12)+S$11*LOG(Grunddaten!$H12)","v":{"$error":"#NUM!"}},{"$f":"T$8+T$9*LOG(Grunddaten!$G12)+T$10*LOG(Grunddaten!$F12)+T$11*LOG(Grunddaten!$H12)","v":{"$error":"#NUM!"}},{"$f":"U$8+U$9*LOG(Grunddaten!$G12)+U$10*LOG(Grunddaten!$F12)+U$11*LOG(Grunddaten!$H12)","v":{"$error":"#NUM!"}},{"$f":"V$8+V$9*LOG(Grunddaten!$G12)+V$10*LOG(Grunddaten!$F12)+V$11*LOG(Grunddaten!$H12)","v":{"$error":"#NUM!"}},{"$error":"#NUM!"}]
[{"$f":"Grunddaten!C13","v":"DAL 358800"},{"$f":"B$8+B$9*LOG(Grunddaten!$G13)+B$10*LOG(Grunddaten!$F13)+B$11*LOG(Grunddaten!$H13)","v":{"$error":"#NUM!"}},{"$f":"C$8+C$9*LOG(Grunddaten!$G13)+C$10*LOG(Grunddaten!$F13)+C$11*LOG(Grunddaten!$H13)","v":{"$error":"#NUM!"}},{"$f":"D$8+D$9*LOG(Grunddaten!$G13)+D$10*LOG(Grunddaten!$F13)+D$11*LOG(Grunddaten!$H13)","v":{"$error":"#NUM!"}},{"$f":"E$8+E$9*LOG(Grunddaten!$G13)+E$10*LOG(Grunddaten!$F13)+E$11*LOG(Grunddaten!$H13)","v":{"$error":"#NUM!"}},{"$f":"F$8+F$9*LOG(Grunddaten!$G13)+F$10*LOG(Grunddaten!$F13)+F$11*LOG(Grunddaten!$H13)","v":{"$error":"#NUM!"}},{"$f":"G$8+G$9*LOG(Grunddaten!$G13)+G$10*LOG(Grunddaten!$F13)+G$11*LOG(Grunddaten!$H13)","v":{"$error":"#NUM!"}},{"$f":"H$8+H$9*LOG(Grunddaten!$G13)+H$10*LOG(Grunddaten!$F13)+H$11*LOG(Grunddaten!$H13)","v":{"$error":"#NUM!"}},{"$f":"I$8+I$9*LOG(Grunddaten!$G13)+I$10*LOG(Grunddaten!$F13)+I$11*LOG(Grunddaten!$H13)","v":{"$error":"#NUM!"}},{"$f":"J$8+J$9*LOG(Grunddaten!$G13)+J$10*LOG(Grunddaten!$F13)+J$11*LOG(Grunddaten!$H13)","v":{"$error":"#NUM!"}},{"$f":"K$8+K$9*LOG(Grunddaten!$G13)+K$10*LOG(Grunddaten!$F13)+K$11*LOG(Grunddaten!$H13)","v":{"$error":"#NUM!"}},{"$f":"L$8+L$9*LOG(Grunddaten!$G13)+L$10*LOG(Grunddaten!$F13)+L$11*LOG(Grunddaten!$H13)","v":{"$error":"#NUM!"}},{"$f":"M$8+M$9*LOG(Grunddaten!$G13)+M$10*LOG(Grunddaten!$F13)+M$11*LOG(Grunddaten!$H13)","v":{"$error":"#NUM!"}},{"$f":"N$8+N$9*LOG(Grunddaten!$G13)+N$10*LOG(Grunddaten!$F13)+N$11*LOG(Grunddaten!$H13)","v":{"$error":"#NUM!"}},{"$f":"O$8+O$9*LOG(Grunddaten!$G13)+O$10*LOG(Grunddaten!$F13)+O$11*LOG(Grunddaten!$H13)","v":{"$error":"#NUM!"}},{"$f":"P$8+P$9*LOG(Grunddaten!$G13)+P$10*LOG(Grunddaten!$F13)+P$11*LOG(Grunddaten!$H13)","v":{"$error":"#NUM!"}},{"$f":"Q$8+Q$9*LOG(Grunddaten!$G13)+Q$10*LOG(Grunddaten!$F13)+Q$11*LOG(Grunddaten!$H13)","v":{"$error":"#NUM!"}},{"$f":"R$8+R$9*LOG(Grunddaten!$G13)+R$10*LOG(Grunddaten!$F13)+R$11*LOG(Grunddaten!$H13)","v":{"$error":"#NUM!"}},{"$f":"S$8+S$9*LOG(Grunddaten!$G13)+S$10*LOG(Grunddaten!$F13)+S$11*LOG(Grunddaten!$H13)","v":{"$error":"#NUM!"}},{"$f":"T$8+T$9*LOG(Grunddaten!$G13)+T$10*LOG(Grunddaten!$F13)+T$11*LOG(Grunddaten!$H13)","v":{"$error":"#NUM!"}},{"$f":"U$8+U$9*LOG(Grunddaten!$G13)+U$10*LOG(Grunddaten!$F13)+U$11*LOG(Grunddaten!$H13)","v":{"$error":"#NUM!"}},{"$f":"V$8+V$9*LOG(Grunddaten!$G13)+V$10*LOG(Grunddaten!$F13)+V$11*LOG(Grunddaten!$H13)","v":{"$error":"#NUM!"}},{"$error":"#NUM!"}]
[{"$f":"Grunddaten!C14","v":"DRS100"},{"$f":"B$8+B$9*LOG(Grunddaten!$G14)+B$10*LOG(Grunddaten!$F14)+B$11*LOG(Grunddaten!$H14)","v":{"$error":"#NUM!"}},{"$f":"C$8+C$9*LOG(Grunddaten!$G14)+C$10*LOG(Grunddaten!$F14)+C$11*LOG(Grunddaten!$H14)","v":{"$error":"#NUM!"}},{"$f":"D$8+D$9*LOG(Grunddaten!$G14)+D$10*LOG(Grunddaten!$F14)+D$11*LOG(Grunddaten!$H14)","v":{"$error":"#NUM!"}},{"$f":"E$8+E$9*LOG(Grunddaten!$G14)+E$10*LOG(Grunddaten!$F14)+E$11*LOG(Grunddaten!$H14)","v":{"$error":"#NUM!"}},{"$f":"F$8+F$9*LOG(Grunddaten!$G14)+F$10*LOG(Grunddaten!$F14)+F$11*LOG(Grunddaten!$H14)","v":{"$error":"#NUM!"}},{"$f":"G$8+G$9*LOG(Grunddaten!$G14)+G$10*LOG(Grunddaten!$F14)+G$11*LOG(Grunddaten!$H14)","v":{"$error":"#NUM!"}},{"$f":"H$8+H$9*LOG(Grunddaten!$G14)+H$10*LOG(Grunddaten!$F14)+H$11*LOG(Grunddaten!$H14)","v":{"$error":"#NUM!"}},{"$f":"I$8+I$9*LOG(Grunddaten!$G14)+I$10*LOG(Grunddaten!$F14)+I$11*LOG(Grunddaten!$H14)","v":{"$error":"#NUM!"}},{"$f":"J$8+J$9*LOG(Grunddaten!$G14)+J$10*LOG(Grunddaten!$F14)+J$11*LOG(Grunddaten!$H14)","v":{"$error":"#NUM!"}},{"$f":"K$8+K$9*LOG(Grunddaten!$G14)+K$10*LOG(Grunddaten!$F14)+K$11*LOG(Grunddaten!$H14)","v":{"$error":"#NUM!"}},{"$f":"L$8+L$9*LOG(Grunddaten!$G14)+L$10*LOG(Grunddaten!$F14)+L$11*LOG(Grunddaten!$H14)","v":{"$error":"#NUM!"}},{"$f":"M$8+M$9*LOG(Grunddaten!$G14)+M$10*LOG(Grunddaten!$F14)+M$11*LOG(Grunddaten!$H14)","v":{"$error":"#NUM!"}},{"$f":"N$8+N$9*LOG(Grunddaten!$G14)+N$10*LOG(Grunddaten!$F14)+N$11*LOG(Grunddaten!$H14)","v":{"$error":"#NUM!"}},{"$f":"O$8+O$9*LOG(Grunddaten!$G14)+O$10*LOG(Grunddaten!$F14)+O$11*LOG(Grunddaten!$H14)","v":{"$error":"#NUM!"}},{"$f":"P$8+P$9*LOG(Grunddaten!$G14)+P$10*LOG(Grunddaten!$F14)+P$11*LOG(Grunddaten!$H14)","v":{"$error":"#NUM!"}},{"$f":"Q$8+Q$9*LOG(Grunddaten!$G14)+Q$10*LOG(Grunddaten!$F14)+Q$11*LOG(Grunddaten!$H14)","v":{"$error":"#NUM!"}},{"$f":"R$8+R$9*LOG(Grunddaten!$G14)+R$10*LOG(Grunddaten!$F14)+R$11*LOG(Grunddaten!$H14)","v":{"$error":"#NUM!"}},{"$f":"S$8+S$9*LOG(Grunddaten!$G14)+S$10*LOG(Grunddaten!$F14)+S$11*LOG(Grunddaten!$H14)","v":{"$error":"#NUM!"}},{"$f":"T$8+T$9*LOG(Grunddaten!$G14)+T$10*LOG(Grunddaten!$F14)+T$11*LOG(Grunddaten!$H14)","v":{"$error":"#NUM!"}},{"$f":"U$8+U$9*LOG(Grunddaten!$G14)+U$10*LOG(Grunddaten!$F14)+U$11*LOG(Grunddaten!$H14)","v":{"$error":"#NUM!"}},{"$f":"V$8+V$9*LOG(Grunddaten!$G14)+V$10*LOG(Grunddaten!$F14)+V$11*LOG(Grunddaten!$H14)","v":{"$error":"#NUM!"}},{"$error":"#NUM!"}]
[{"$f":"Grunddaten!C15","v":"DRS125"},{"$f":"B$8+B$9*LOG(Grunddaten!$G15)+B$10*LOG(Grunddaten!$F15)+B$11*LOG(Grunddaten!$H15)","v":{"$error":"#NUM!"}},{"$f":"C$8+C$9*LOG(Grunddaten!$G15)+C$10*LOG(Grunddaten!$F15)+C$11*LOG(Grunddaten!$H15)","v":{"$error":"#NUM!"}},{"$f":"D$8+D$9*LOG(Grunddaten!$G15)+D$10*LOG(Grunddaten!$F15)+D$11*LOG(Grunddaten!$H15)","v":{"$error":"#NUM!"}},{"$f":"E$8+E$9*LOG(Grunddaten!$G15)+E$10*LOG(Grunddaten!$F15)+E$11*LOG(Grunddaten!$H15)","v":{"$error":"#NUM!"}},{"$f":"F$8+F$9*LOG(Grunddaten!$G15)+F$10*LOG(Grunddaten!$F15)+F$11*LOG(Grunddaten!$H15)","v":{"$error":"#NUM!"}},{"$f":"G$8+G$9*LOG(Grunddaten!$G15)+G$10*LOG(Grunddaten!$F15)+G$11*LOG(Grunddaten!$H15)","v":{"$error":"#NUM!"}},{"$f":"H$8+H$9*LOG(Grunddaten!$G15)+H$10*LOG(Grunddaten!$F15)+H$11*LOG(Grunddaten!$H15)","v":{"$error":"#NUM!"}},{"$f":"I$8+I$9*LOG(Grunddaten!$G15)+I$10*LOG(Grunddaten!$F15)+I$11*LOG(Grunddaten!$H15)","v":{"$error":"#NUM!"}},{"$f":"J$8+J$9*LOG(Grunddaten!$G15)+J$10*LOG(Grunddaten!$F15)+J$11*LOG(Grunddaten!$H15)","v":{"$error":"#NUM!"}},{"$f":"K$8+K$9*LOG(Grunddaten!$G15)+K$10*LOG(Grunddaten!$F15)+K$11*LOG(Grunddaten!$H15)","v":{"$error":"#NUM!"}},{"$f":"L$8+L$9*LOG(Grunddaten!$G15)+L$10*LOG(Grunddaten!$F15)+L$11*LOG(Grunddaten!$H15)","v":{"$error":"#NUM!"}},{"$f":"M$8+M$9*LOG(Grunddaten!$G15)+M$10*LOG(Grunddaten!$F15)+M$11*LOG(Grunddaten!$H15)","v":{"$error":"#NUM!"}},{"$f":"N$8+N$9*LOG(Grunddaten!$G15)+N$10*LOG(Grunddaten!$F15)+N$11*LOG(Grunddaten!$H15)","v":{"$error":"#NUM!"}},{"$f":"O$8+O$9*LOG(Grunddaten!$G15)+O$10*LOG(Grunddaten!$F15)+O$11*LOG(Grunddaten!$H15)","v":{"$error":"#NUM!"}},{"$f":"P$8+P$9*LOG(Grunddaten!$G15)+P$10*LOG(Grunddaten!$F15)+P$11*LOG(Grunddaten!$H15)","v":{"$error":"#NUM!"}},{"$f":"Q$8+Q$9*LOG(Grunddaten!$G15)+Q$10*LOG(Grunddaten!$F15)+Q$11*LOG(Grunddaten!$H15)","v":{"$error":"#NUM!"}},{"$f":"R$8+R$9*LOG(Grunddaten!$G15)+R$10*LOG(Grunddaten!$F15)+R$11*LOG(Grunddaten!$H15)","v":{"$error":"#NUM!"}},{"$f":"S$8+S$9*LOG(Grunddaten!$G15)+S$10*LOG(Grunddaten!$F15)+S$11*LOG(Grunddaten!$H15)","v":{"$error":"#NUM!"}},{"$f":"T$8+T$9*LOG(Grunddaten!$G15)+T$10*LOG(Grunddaten!$F15)+T$11*LOG(Grunddaten!$H15)","v":{"$error":"#NUM!"}},{"$f":"U$8+U$9*LOG(Grunddaten!$G15)+U$10*LOG(Grunddaten!$F15)+U$11*LOG(Grunddaten!$H15)","v":{"$error":"#NUM!"}},{"$f":"V$8+V$9*LOG(Grunddaten!$G15)+V$10*LOG(Grunddaten!$F15)+V$11*LOG(Grunddaten!$H15)","v":{"$error":"#NUM!"}},{"$error":"#NUM!"}]
[{"$f":"Grunddaten!C16","v":"DRS180"},{"$f":"B$8+B$9*LOG(Grunddaten!$G16)+B$10*LOG(Grunddaten!$F16)+B$11*LOG(Grunddaten!$H16)","v":{"$error":"#NUM!"}},{"$f":"C$8+C$9*LOG(Grunddaten!$G16)+C$10*LOG(Grunddaten!$F16)+C$11*LOG(Grunddaten!$H16)","v":{"$error":"#NUM!"}},{"$f":"D$8+D$9*LOG(Grunddaten!$G16)+D$10*LOG(Grunddaten!$F16)+D$11*LOG(Grunddaten!$H16)","v":{"$error":"#NUM!"}},{"$f":"E$8+E$9*LOG(Grunddaten!$G16)+E$10*LOG(Grunddaten!$F16)+E$11*LOG(Grunddaten!$H16)","v":{"$error":"#NUM!"}},{"$f":"F$8+F$9*LOG(Grunddaten!$G16)+F$10*LOG(Grunddaten!$F16)+F$11*LOG(Grunddaten!$H16)","v":{"$error":"#NUM!"}},{"$f":"G$8+G$9*LOG(Grunddaten!$G16)+G$10*LOG(Grunddaten!$F16)+G$11*LOG(Grunddaten!$H16)","v":{"$error":"#NUM!"}},{"$f":"H$8+H$9*LOG(Grunddaten!$G16)+H$10*LOG(Grunddaten!$F16)+H$11*LOG(Grunddaten!$H16)","v":{"$error":"#NUM!"}},{"$f":"I$8+I$9*LOG(Grunddaten!$G16)+I$10*LOG(Grunddaten!$F16)+I$11*LOG(Grunddaten!$H16)","v":{"$error":"#NUM!"}},{"$f":"J$8+J$9*LOG(Grunddaten!$G16)+J$10*LOG(Grunddaten!$F16)+J$11*LOG(Grunddaten!$H16)","v":{"$error":"#NUM!"}},{"$f":"K$8+K$9*LOG(Grunddaten!$G16)+K$10*LOG(Grunddaten!$F16)+K$11*LOG(Grunddaten!$H16)","v":{"$error":"#NUM!"}},{"$f":"L$8+L$9*LOG(Grunddaten!$G16)+L$10*LOG(Grunddaten!$F16)+L$11*LOG(Grunddaten!$H16)","v":{"$error":"#NUM!"}},{"$f":"M$8+M$9*LOG(Grunddaten!$G16)+M$10*LOG(Grunddaten!$F16)+M$11*LOG(Grunddaten!$H16)","v":{"$error":"#NUM!"}},{"$f":"N$8+N$9*LOG(Grunddaten!$G16)+N$10*LOG(Grunddaten!$F16)+N$11*LOG(Grunddaten!$H16)","v":{"$error":"#NUM!"}},{"$f":"O$8+O$9*LOG(Grunddaten!$G16)+O$10*LOG(Grunddaten!$F16)+O$11*LOG(Grunddaten!$H16)","v":{"$error":"#NUM!"}},{"$f":"P$8+P$9*LOG(Grunddaten!$G16)+P$10*LOG(Grunddaten!$F16)+P$11*LOG(Grunddaten!$H16)","v":{"$error":"#NUM!"}},{"$f":"Q$8+Q$9*LOG(Grunddaten!$G16)+Q$10*LOG(Grunddaten!$F16)+Q$11*LOG(Grunddaten!$H16)","v":{"$error":"#NUM!"}},{"$f":"R$8+R$9*LOG(Grunddaten!$G16)+R$10*LOG(Grunddaten!$F16)+R$11*LOG(Grunddaten!$H16)","v":{"$error":"#NUM!"}},{"$f":"S$8+S$9*LOG(Grunddaten!$G16)+S$10*LOG(Grunddaten!$F16)+S$11*LOG(Grunddaten!$H16)","v":{"$error":"#NUM!"}},{"$f":"T$8+T$9*LOG(Grunddaten!$G16)+T$10*LOG(Grunddaten!$F16)+T$11*LOG(Grunddaten!$H16)","v":{"$error":"#NUM!"}},{"$f":"U$8+U$9*LOG(Grunddaten!$G16)+U$10*LOG(Grunddaten!$F16)+U$11*LOG(Grunddaten!$H16)","v":{"$error":"#NUM!"}},{"$f":"V$8+V$9*LOG(Grunddaten!$G16)+V$10*LOG(Grunddaten!$F16)+V$11*LOG(Grunddaten!$H16)","v":{"$error":"#NUM!"}},{"$error":"#NUM!"}]
[{"$f":"Grunddaten!C17","v":"DRS250"},{"$f":"B$8+B$9*LOG(Grunddaten!$G17)+B$10*LOG(Grunddaten!$F17)+B$11*LOG(Grunddaten!$H17)","v":{"$error":"#NUM!"}},{"$f":"C$8+C$9*LOG(Grunddaten!$G17)+C$10*LOG(Grunddaten!$F17)+C$11*LOG(Grunddaten!$H17)","v":{"$error":"#NUM!"}},{"$f":"D$8+D$9*LOG(Grunddaten!$G17)+D$10*LOG(Grunddaten!$F17)+D$11*LOG(Grunddaten!$H17)","v":{"$error":"#NUM!"}},{"$f":"E$8+E$9*LOG(Grunddaten!$G17)+E$10*LOG(Grunddaten!$F17)+E$11*LOG(Grunddaten!$H17)","v":{"$error":"#NUM!"}},{"$f":"F$8+F$9*LOG(Grunddaten!$G17)+F$10*LOG(Grunddaten!$F17)+F$11*LOG(Grunddaten!$H17)","v":{"$error":"#NUM!"}},{"$f":"G$8+G$9*LOG(Grunddaten!$G17)+G$10*LOG(Grunddaten!$F17)+G$11*LOG(Grunddaten!$H17)","v":{"$error":"#NUM!"}},{"$f":"H$8+H$9*LOG(Grunddaten!$G17)+H$10*LOG(Grunddaten!$F17)+H$11*LOG(Grunddaten!$H17)","v":{"$error":"#NUM!"}},{"$f":"I$8+I$9*LOG(Grunddaten!$G17)+I$10*LOG(Grunddaten!$F17)+I$11*LOG(Grunddaten!$H17)","v":{"$error":"#NUM!"}},{"$f":"J$8+J$9*LOG(Grunddaten!$G17)+J$10*LOG(Grunddaten!$F17)+J$11*LOG(Grunddaten!$H17)","v":{"$error":"#NUM!"}},{"$f":"K$8+K$9*LOG(Grunddaten!$G17)+K$10*LOG(Grunddaten!$F17)+K$11*LOG(Grunddaten!$H17)","v":{"$error":"#NUM!"}},{"$f":"L$8+L$9*LOG(Grunddaten!$G17)+L$10*LOG(Grunddaten!$F17)+L$11*LOG(Grunddaten!$H17)","v":{"$error":"#NUM!"}},{"$f":"M$8+M$9*LOG(Grunddaten!$G17)+M$10*LOG(Grunddaten!$F17)+M$11*LOG(Grunddaten!$H17)","v":{"$error":"#NUM!"}},{"$f":"N$8+N$9*LOG(Grunddaten!$G17)+N$10*LOG(Grunddaten!$F17)+N$11*LOG(Grunddaten!$H17)","v":{"$error":"#NUM!"}},{"$f":"O$8+O$9*LOG(Grunddaten!$G17)+O$10*LOG(Grunddaten!$F17)+O$11*LOG(Grunddaten!$H17)","v":{"$error":"#NUM!"}},{"$f":"P$8+P$9*LOG(Grunddaten!$G17)+P$10*LOG(Grunddaten!$F17)+P$11*LOG(Grunddaten!$H17)","v":{"$error":"#NUM!"}},{"$f":"Q$8+Q$9*LOG(Grunddaten!$G17)+Q$10*LOG(Grunddaten!$F17)+Q$11*LOG(Grunddaten!$H17)","v":{"$error":"#NUM!"}},{"$f":"R$8+R$9*LOG(Grunddaten!$G17)+R$10*LOG(Grunddaten!$F17)+R$11*LOG(Grunddaten!$H17)","v":{"$error":"#NUM!"}},{"$f":"S$8+S$9*LOG(Grunddaten!$G17)+S$10*LOG(Grunddaten!$F17)+S$11*LOG(Grunddaten!$H17)","v":{"$error":"#NUM!"}},{"$f":"T$8+T$9*LOG(Grunddaten!$G17)+T$10*LOG(Grunddaten!$F17)+T$11*LOG(Grunddaten!$H17)","v":{"$error":"#NUM!"}},{"$f":"U$8+U$9*LOG(Grunddaten!$G17)+U$10*LOG(Grunddaten!$F17)+U$11*LOG(Grunddaten!$H17)","v":{"$error":"#NUM!"}},{"$f":"V$8+V$9*LOG(Grunddaten!$G17)+V$10*LOG(Grunddaten!$F17)+V$11*LOG(Grunddaten!$H17)","v":{"$error":"#NUM!"}},{"$error":"#NUM!"}]
[{"$f":"Grunddaten!C18","v":"DRS315"},{"$f":"B$8+B$9*LOG(Grunddaten!$G18)+B$10*LOG(Grunddaten!$F18)+B$11*LOG(Grunddaten!$H18)","v":{"$error":"#NUM!"}},{"$f":"C$8+C$9*LOG(Grunddaten!$G18)+C$10*LOG(Grunddaten!$F18)+C$11*LOG(Grunddaten!$H18)","v":{"$error":"#NUM!"}},{"$f":"D$8+D$9*LOG(Grunddaten!$G18)+D$10*LOG(Grunddaten!$F18)+D$11*LOG(Grunddaten!$H18)","v":{"$error":"#NUM!"}},{"$f":"E$8+E$9*LOG(Grunddaten!$G18)+E$10*LOG(Grunddaten!$F18)+E$11*LOG(Grunddaten!$H18)","v":{"$error":"#NUM!"}},{"$f":"F$8+F$9*LOG(Grunddaten!$G18)+F$10*LOG(Grunddaten!$F18)+F$11*LOG(Grunddaten!$H18)","v":{"$error":"#NUM!"}},{"$f":"G$8+G$9*LOG(Grunddaten!$G18)+G$10*LOG(Grunddaten!$F18)+G$11*LOG(Grunddaten!$H18)","v":{"$error":"#NUM!"}},{"$f":"H$8+H$9*LOG(Grunddaten!$G18)+H$10*LOG(Grunddaten!$F18)+H$11*LOG(Grunddaten!$H18)","v":{"$error":"#NUM!"}},{"$f":"I$8+I$9*LOG(Grunddaten!$G18)+I$10*LOG(Grunddaten!$F18)+I$11*LOG(Grunddaten!$H18)","v":{"$error":"#NUM!"}},{"$f":"J$8+J$9*LOG(Grunddaten!$G18)+J$10*LOG(Grunddaten!$F18)+J$11*LOG(Grunddaten!$H18)","v":{"$error":"#NUM!"}},{"$f":"K$8+K$9*LOG(Grunddaten!$G18)+K$10*LOG(Grunddaten!$F18)+K$11*LOG(Grunddaten!$H18)","v":{"$error":"#NUM!"}},{"$f":"L$8+L$9*LOG(Grunddaten!$G18)+L$10*LOG(Grunddaten!$F18)+L$11*LOG(Grunddaten!$H18)","v":{"$error":"#NUM!"}},{"$f":"M$8+M$9*LOG(Grunddaten!$G18)+M$10*LOG(Grunddaten!$F18)+M$11*LOG(Grunddaten!$H18)","v":{"$error":"#NUM!"}},{"$f":"N$8+N$9*LOG(Grunddaten!$G18)+N$10*LOG(Grunddaten!$F18)+N$11*LOG(Grunddaten!$H18)","v":{"$error":"#NUM!"}},{"$f":"O$8+O$9*LOG(Grunddaten!$G18)+O$10*LOG(Grunddaten!$F18)+O$11*LOG(Grunddaten!$H18)","v":{"$error":"#NUM!"}},{"$f":"P$8+P$9*LOG(Grunddaten!$G18)+P$10*LOG(Grunddaten!$F18)+P$11*LOG(Grunddaten!$H18)","v":{"$error":"#NUM!"}},{"$f":"Q$8+Q$9*LOG(Grunddaten!$G18)+Q$10*LOG(Grunddaten!$F18)+Q$11*LOG(Grunddaten!$H18)","v":{"$error":"#NUM!"}},{"$f":"R$8+R$9*LOG(Grunddaten!$G18)+R$10*LOG(Grunddaten!$F18)+R$11*LOG(Grunddaten!$H18)","v":{"$error":"#NUM!"}},{"$f":"S$8+S$9*LOG(Grunddaten!$G18)+S$10*LOG(Grunddaten!$F18)+S$11*LOG(Grunddaten!$H18)","v":{"$error":"#NUM!"}},{"$f":"T$8+T$9*LOG(Grunddaten!$G18)+T$10*LOG(Grunddaten!$F18)+T$11*LOG(Grunddaten!$H18)","v":{"$error":"#NUM!"}},{"$f":"U$8+U$9*LOG(Grunddaten!$G18)+U$10*LOG(Grunddaten!$F18)+U$11*LOG(Grunddaten!$H18)","v":{"$error":"#NUM!"}},{"$f":"V$8+V$9*LOG(Grunddaten!$G18)+V$10*LOG(Grunddaten!$F18)+V$11*LOG(Grunddaten!$H18)","v":{"$error":"#NUM!"}},{"$error":"#NUM!"}]
[{"$f":"Grunddaten!C19","v":"DRS355"},{"$f":"B$8+B$9*LOG(Grunddaten!$G19)+B$10*LOG(Grunddaten!$F19)+B$11*LOG(Grunddaten!$H19)","v":{"$error":"#NUM!"}},{"$f":"C$8+C$9*LOG(Grunddaten!$G19)+C$10*LOG(Grunddaten!$F19)+C$11*LOG(Grunddaten!$H19)","v":{"$error":"#NUM!"}},{"$f":"D$8+D$9*LOG(Grunddaten!$G19)+D$10*LOG(Grunddaten!$F19)+D$11*LOG(Grunddaten!$H19)","v":{"$error":"#NUM!"}},{"$f":"E$8+E$9*LOG(Grunddaten!$G19)+E$10*LOG(Grunddaten!$F19)+E$11*LOG(Grunddaten!$H19)","v":{"$error":"#NUM!"}},{"$f":"F$8+F$9*LOG(Grunddaten!$G19)+F$10*LOG(Grunddaten!$F19)+F$11*LOG(Grunddaten!$H19)","v":{"$error":"#NUM!"}},{"$f":"G$8+G$9*LOG(Grunddaten!$G19)+G$10*LOG(Grunddaten!$F19)+G$11*LOG(Grunddaten!$H19)","v":{"$error":"#NUM!"}},{"$f":"H$8+H$9*LOG(Grunddaten!$G19)+H$10*LOG(Grunddaten!$F19)+H$11*LOG(Grunddaten!$H19)","v":{"$error":"#NUM!"}},{"$f":"I$8+I$9*LOG(Grunddaten!$G19)+I$10*LOG(Grunddaten!$F19)+I$11*LOG(Grunddaten!$H19)","v":{"$error":"#NUM!"}},{"$f":"J$8+J$9*LOG(Grunddaten!$G19)+J$10*LOG(Grunddaten!$F19)+J$11*LOG(Grunddaten!$H19)","v":{"$error":"#NUM!"}},{"$f":"K$8+K$9*LOG(Grunddaten!$G19)+K$10*LOG(Grunddaten!$F19)+K$11*LOG(Grunddaten!$H19)","v":{"$error":"#NUM!"}},{"$f":"L$8+L$9*LOG(Grunddaten!$G19)+L$10*LOG(Grunddaten!$F19)+L$11*LOG(Grunddaten!$H19)","v":{"$error":"#NUM!"}},{"$f":"M$8+M$9*LOG(Grunddaten!$G19)+M$10*LOG(Grunddaten!$F19)+M$11*LOG(Grunddaten!$H19)","v":{"$error":"#NUM!"}},{"$f":"N$8+N$9*LOG(Grunddaten!$G19)+N$10*LOG(Grunddaten!$F19)+N$11*LOG(Grunddaten!$H19)","v":{"$error":"#NUM!"}},{"$f":"O$8+O$9*LOG(Grunddaten!$G19)+O$10*LOG(Grunddaten!$F19)+O$11*LOG(Grunddaten!$H19)","v":{"$error":"#NUM!"}},{"$f":"P$8+P$9*LOG(Grunddaten!$G19)+P$10*LOG(Grunddaten!$F19)+P$11*LOG(Grunddaten!$H19)","v":{"$error":"#NUM!"}},{"$f":"Q$8+Q$9*LOG(Grunddaten!$G19)+Q$10*LOG(Grunddaten!$F19)+Q$11*LOG(Grunddaten!$H19)","v":{"$error":"#NUM!"}},{"$f":"R$8+R$9*LOG(Grunddaten!$G19)+R$10*LOG(Grunddaten!$F19)+R$11*LOG(Grunddaten!$H19)","v":{"$error":"#NUM!"}},{"$f":"S$8+S$9*LOG(Grunddaten!$G19)+S$10*LOG(Grunddaten!$F19)+S$11*LOG(Grunddaten!$H19)","v":{"$error":"#NUM!"}},{"$f":"T$8+T$9*LOG(Grunddaten!$G19)+T$10*LOG(Grunddaten!$F19)+T$11*LOG(Grunddaten!$H19)","v":{"$error":"#NUM!"}},{"$f":"U$8+U$9*LOG(Grunddaten!$G19)+U$10*LOG(Grunddaten!$F19)+U$11*LOG(Grunddaten!$H19)","v":{"$error":"#NUM!"}},{"$f":"V$8+V$9*LOG(Grunddaten!$G19)+V$10*LOG(Grunddaten!$F19)+V$11*LOG(Grunddaten!$H19)","v":{"$error":"#NUM!"}},{"$error":"#NUM!"}]
[{"$f":"Grunddaten!C20","v":"DIA100"},{"$f":"B$8+B$9*LOG(Grunddaten!$G20)+B$10*LOG(Grunddaten!$F20)+B$11*LOG(Grunddaten!$H20)","v":{"$error":"#NUM!"}},{"$f":"C$8+C$9*LOG(Grunddaten!$G20)+C$10*LOG(Grunddaten!$F20)+C$11*LOG(Grunddaten!$H20)","v":{"$error":"#NUM!"}},{"$f":"D$8+D$9*LOG(Grunddaten!$G20)+D$10*LOG(Grunddaten!$F20)+D$11*LOG(Grunddaten!$H20)","v":{"$error":"#NUM!"}},{"$f":"E$8+E$9*LOG(Grunddaten!$G20)+E$10*LOG(Grunddaten!$F20)+E$11*LOG(Grunddaten!$H20)","v":{"$error":"#NUM!"}},{"$f":"F$8+F$9*LOG(Grunddaten!$G20)+F$10*LOG(Grunddaten!$F20)+F$11*LOG(Grunddaten!$H20)","v":{"$error":"#NUM!"}},{"$f":"G$8+G$9*LOG(Grunddaten!$G20)+G$10*LOG(Grunddaten!$F20)+G$11*LOG(Grunddaten!$H20)","v":{"$error":"#NUM!"}},{"$f":"H$8+H$9*LOG(Grunddaten!$G20)+H$10*LOG(Grunddaten!$F20)+H$11*LOG(Grunddaten!$H20)","v":{"$error":"#NUM!"}},{"$f":"I$8+I$9*LOG(Grunddaten!$G20)+I$10*LOG(Grunddaten!$F20)+I$11*LOG(Grunddaten!$H20)","v":{"$error":"#NUM!"}},{"$f":"J$8+J$9*LOG(Grunddaten!$G20)+J$10*LOG(Grunddaten!$F20)+J$11*LOG(Grunddaten!$H20)","v":{"$error":"#NUM!"}},{"$f":"K$8+K$9*LOG(Grunddaten!$G20)+K$10*LOG(Grunddaten!$F20)+K$11*LOG(Grunddaten!$H20)","v":{"$error":"#NUM!"}},{"$f":"L$8+L$9*LOG(Grunddaten!$G20)+L$10*LOG(Grunddaten!$F20)+L$11*LOG(Grunddaten!$H20)","v":{"$error":"#NUM!"}},{"$f":"M$8+M$9*LOG(Grunddaten!$G20)+M$10*LOG(Grunddaten!$F20)+M$11*LOG(Grunddaten!$H20)","v":{"$error":"#NUM!"}},{"$f":"N$8+N$9*LOG(Grunddaten!$G20)+N$10*LOG(Grunddaten!$F20)+N$11*LOG(Grunddaten!$H20)","v":{"$error":"#NUM!"}},{"$f":"O$8+O$9*LOG(Grunddaten!$G20)+O$10*LOG(Grunddaten!$F20)+O$11*LOG(Grunddaten!$H20)","v":{"$error":"#NUM!"}},{"$f":"P$8+P$9*LOG(Grunddaten!$G20)+P$10*LOG(Grunddaten!$F20)+P$11*LOG(Grunddaten!$H20)","v":{"$error":"#NUM!"}},{"$f":"Q$8+Q$9*LOG(Grunddaten!$G20)+Q$10*LOG(Grunddaten!$F20)+Q$11*LOG(Grunddaten!$H20)","v":{"$error":"#NUM!"}},{"$f":"R$8+R$9*LOG(Grunddaten!$G20)+R$10*LOG(Grunddaten!$F20)+R$11*LOG(Grunddaten!$H20)","v":{"$error":"#NUM!"}},{"$f":"S$8+S$9*LOG(Grunddaten!$G20)+S$10*LOG(Grunddaten!$F20)+S$11*LOG(Grunddaten!$H20)","v":{"$error":"#NUM!"}},{"$f":"T$8+T$9*LOG(Grunddaten!$G20)+T$10*LOG(Grunddaten!$F20)+T$11*LOG(Grunddaten!$H20)","v":{"$error":"#NUM!"}},{"$f":"U$8+U$9*LOG(Grunddaten!$G20)+U$10*LOG(Grunddaten!$F20)+U$11*LOG(Grunddaten!$H20)","v":{"$error":"#NUM!"}},{"$f":"V$8+V$9*LOG(Grunddaten!$G20)+V$10*LOG(Grunddaten!$F20)+V$11*LOG(Grunddaten!$H20)","v":{"$error":"#NUM!"}},{"$error":"#NUM!"}]
[{"$f":"Grunddaten!C21","v":"DIA125"},{"$f":"B$8+B$9*LOG(Grunddaten!$G21)+B$10*LOG(Grunddaten!$F21)+B$11*LOG(Grunddaten!$H21)","v":{"$error":"#NUM!"}},{"$f":"C$8+C$9*LOG(Grunddaten!$G21)+C$10*LOG(Grunddaten!$F21)+C$11*LOG(Grunddaten!$H21)","v":{"$error":"#NUM!"}},{"$f":"D$8+D$9*LOG(Grunddaten!$G21)+D$10*LOG(Grunddaten!$F21)+D$11*LOG(Grunddaten!$H21)","v":{"$error":"#NUM!"}},{"$f":"E$8+E$9*LOG(Grunddaten!$G21)+E$10*LOG(Grunddaten!$F21)+E$11*LOG(Grunddaten!$H21)","v":{"$error":"#NUM!"}},{"$f":"F$8+F$9*LOG(Grunddaten!$G21)+F$10*LOG(Grunddaten!$F21)+F$11*LOG(Grunddaten!$H21)","v":{"$error":"#NUM!"}},{"$f":"G$8+G$9*LOG(Grunddaten!$G21)+G$10*LOG(Grunddaten!$F21)+G$11*LOG(Grunddaten!$H21)","v":{"$error":"#NUM!"}},{"$f":"H$8+H$9*LOG(Grunddaten!$G21)+H$10*LOG(Grunddaten!$F21)+H$11*LOG(Grunddaten!$H21)","v":{"$error":"#NUM!"}},{"$f":"I$8+I$9*LOG(Grunddaten!$G21)+I$10*LOG(Grunddaten!$F21)+I$11*LOG(Grunddaten!$H21)","v":{"$error":"#NUM!"}},{"$f":"J$8+J$9*LOG(Grunddaten!$G21)+J$10*LOG(Grunddaten!$F21)+J$11*LOG(Grunddaten!$H21)","v":{"$error":"#NUM!"}},{"$f":"K$8+K$9*LOG(Grunddaten!$G21)+K$10*LOG(Grunddaten!$F21)+K$11*LOG(Grunddaten!$H21)","v":{"$error":"#NUM!"}},{"$f":"L$8+L$9*LOG(Grunddaten!$G21)+L$10*LOG(Grunddaten!$F21)+L$11*LOG(Grunddaten!$H21)","v":{"$error":"#NUM!"}},{"$f":"M$8+M$9*LOG(Grunddaten!$G21)+M$10*LOG(Grunddaten!$F21)+M$11*LOG(Grunddaten!$H21)","v":{"$error":"#NUM!"}},{"$f":"N$8+N$9*LOG(Grunddaten!$G21)+N$10*LOG(Grunddaten!$F21)+N$11*LOG(Grunddaten!$H21)","v":{"$error":"#NUM!"}},{"$f":"O$8+O$9*LOG(Grunddaten!$G21)+O$10*LOG(Grunddaten!$F21)+O$11*LOG(Grunddaten!$H21)","v":{"$error":"#NUM!"}},{"$f":"P$8+P$9*LOG(Grunddaten!$G21)+P$10*LOG(Grunddaten!$F21)+P$11*LOG(Grunddaten!$H21)","v":{"$error":"#NUM!"}},{"$f":"Q$8+Q$9*LOG(Grunddaten!$G21)+Q$10*LOG(Grunddaten!$F21)+Q$11*LOG(Grunddaten!$H21)","v":{"$error":"#NUM!"}},{"$f":"R$8+R$9*LOG(Grunddaten!$G21)+R$10*LOG(Grunddaten!$F21)+R$11*LOG(Grunddaten!$H21)","v":{"$error":"#NUM!"}},{"$f":"S$8+S$9*LOG(Grunddaten!$G21)+S$10*LOG(Grunddaten!$F21)+S$11*LOG(Grunddaten!$H21)","v":{"$error":"#NUM!"}},{"$f":"T$8+T$9*LOG(Grunddaten!$G21)+T$10*LOG(Grunddaten!$F21)+T$11*LOG(Grunddaten!$H21)","v":{"$error":"#NUM!"}},{"$f":"U$8+U$9*LOG(Grunddaten!$G21)+U$10*LOG(Grunddaten!$F21)+U$11*LOG(Grunddaten!$H21)","v":{"$error":"#NUM!"}},{"$f":"V$8+V$9*LOG(Grunddaten!$G21)+V$10*LOG(Grunddaten!$F21)+V$11*LOG(Grunddaten!$H21)","v":{"$error":"#NUM!"}},{"$error":"#NUM!"}]
[{"$f":"Grunddaten!C22","v":"DIA180"},{"$f":"B$8+B$9*LOG(Grunddaten!$G22)+B$10*LOG(Grunddaten!$F22)+B$11*LOG(Grunddaten!$H22)","v":{"$error":"#NUM!"}},{"$f":"C$8+C$9*LOG(Grunddaten!$G22)+C$10*LOG(Grunddaten!$F22)+C$11*LOG(Grunddaten!$H22)","v":{"$error":"#NUM!"}},{"$f":"D$8+D$9*LOG(Grunddaten!$G22)+D$10*LOG(Grunddaten!$F22)+D$11*LOG(Grunddaten!$H22)","v":{"$error":"#NUM!"}},{"$f":"E$8+E$9*LOG(Grunddaten!$G22)+E$10*LOG(Grunddaten!$F22)+E$11*LOG(Grunddaten!$H22)","v":{"$error":"#NUM!"}},{"$f":"F$8+F$9*LOG(Grunddaten!$G22)+F$10*LOG(Grunddaten!$F22)+F$11*LOG(Grunddaten!$H22)","v":{"$error":"#NUM!"}},{"$f":"G$8+G$9*LOG(Grunddaten!$G22)+G$10*LOG(Grunddaten!$F22)+G$11*LOG(Grunddaten!$H22)","v":{"$error":"#NUM!"}},{"$f":"H$8+H$9*LOG(Grunddaten!$G22)+H$10*LOG(Grunddaten!$F22)+H$11*LOG(Grunddaten!$H22)","v":{"$error":"#NUM!"}},{"$f":"I$8+I$9*LOG(Grunddaten!$G22)+I$10*LOG(Grunddaten!$F22)+I$11*LOG(Grunddaten!$H22)","v":{"$error":"#NUM!"}},{"$f":"J$8+J$9*LOG(Grunddaten!$G22)+J$10*LOG(Grunddaten!$F22)+J$11*LOG(Grunddaten!$H22)","v":{"$error":"#NUM!"}},{"$f":"K$8+K$9*LOG(Grunddaten!$G22)+K$10*LOG(Grunddaten!$F22)+K$11*LOG(Grunddaten!$H22)","v":{"$error":"#NUM!"}},{"$f":"L$8+L$9*LOG(Grunddaten!$G22)+L$10*LOG(Grunddaten!$F22)+L$11*LOG(Grunddaten!$H22)","v":{"$error":"#NUM!"}},{"$f":"M$8+M$9*LOG(Grunddaten!$G22)+M$10*LOG(Grunddaten!$F22)+M$11*LOG(Grunddaten!$H22)","v":{"$error":"#NUM!"}},{"$f":"N$8+N$9*LOG(Grunddaten!$G22)+N$10*LOG(Grunddaten!$F22)+N$11*LOG(Grunddaten!$H22)","v":{"$error":"#NUM!"}},{"$f":"O$8+O$9*LOG(Grunddaten!$G22)+O$10*LOG(Grunddaten!$F22)+O$11*LOG(Grunddaten!$H22)","v":{"$error":"#NUM!"}},{"$f":"P$8+P$9*LOG(Grunddaten!$G22)+P$10*LOG(Grunddaten!$F22)+P$11*LOG(Grunddaten!$H22)","v":{"$error":"#NUM!"}},{"$f":"Q$8+Q$9*LOG(Grunddaten!$G22)+Q$10*LOG(Grunddaten!$F22)+Q$11*LOG(Grunddaten!$H22)","v":{"$error":"#NUM!"}},{"$f":"R$8+R$9*LOG(Grunddaten!$G22)+R$10*LOG(Grunddaten!$F22)+R$11*LOG(Grunddaten!$H22)","v":{"$error":"#NUM!"}},{"$f":"S$8+S$9*LOG(Grunddaten!$G22)+S$10*LOG(Grunddaten!$F22)+S$11*LOG(Grunddaten!$H22)","v":{"$error":"#NUM!"}},{"$f":"T$8+T$9*LOG(Grunddaten!$G22)+T$10*LOG(Grunddaten!$F22)+T$11*LOG(Grunddaten!$H22)","v":{"$error":"#NUM!"}},{"$f":"U$8+U$9*LOG(Grunddaten!$G22)+U$10*LOG(Grunddaten!$F22)+U$11*LOG(Grunddaten!$H22)","v":{"$error":"#NUM!"}},{"$f":"V$8+V$9*LOG(Grunddaten!$G22)+V$10*LOG(Grunddaten!$F22)+V$11*LOG(Grunddaten!$H22)","v":{"$error":"#NUM!"}},{"$error":"#NUM!"}]
[{"$f":"Grunddaten!C23","v":"DIA250"},{"$f":"B$8+B$9*LOG(Grunddaten!$G23)+B$10*LOG(Grunddaten!$F23)+B$11*LOG(Grunddaten!$H23)","v":{"$error":"#NUM!"}},{"$f":"C$8+C$9*LOG(Grunddaten!$G23)+C$10*LOG(Grunddaten!$F23)+C$11*LOG(Grunddaten!$H23)","v":{"$error":"#NUM!"}},{"$f":"D$8+D$9*LOG(Grunddaten!$G23)+D$10*LOG(Grunddaten!$F23)+D$11*LOG(Grunddaten!$H23)","v":{"$error":"#NUM!"}},{"$f":"E$8+E$9*LOG(Grunddaten!$G23)+E$10*LOG(Grunddaten!$F23)+E$11*LOG(Grunddaten!$H23)","v":{"$error":"#NUM!"}},{"$f":"F$8+F$9*LOG(Grunddaten!$G23)+F$10*LOG(Grunddaten!$F23)+F$11*LOG(Grunddaten!$H23)","v":{"$error":"#NUM!"}},{"$f":"G$8+G$9*LOG(Grunddaten!$G23)+G$10*LOG(Grunddaten!$F23)+G$11*LOG(Grunddaten!$H23)","v":{"$error":"#NUM!"}},{"$f":"H$8+H$9*LOG(Grunddaten!$G23)+H$10*LOG(Grunddaten!$F23)+H$11*LOG(Grunddaten!$H23)","v":{"$error":"#NUM!"}},{"$f":"I$8+I$9*LOG(Grunddaten!$G23)+I$10*LOG(Grunddaten!$F23)+I$11*LOG(Grunddaten!$H23)","v":{"$error":"#NUM!"}},{"$f":"J$8+J$9*LOG(Grunddaten!$G23)+J$10*LOG(Grunddaten!$F23)+J$11*LOG(Grunddaten!$H23)","v":{"$error":"#NUM!"}},{"$f":"K$8+K$9*LOG(Grunddaten!$G23)+K$10*LOG(Grunddaten!$F23)+K$11*LOG(Grunddaten!$H23)","v":{"$error":"#NUM!"}},{"$f":"L$8+L$9*LOG(Grunddaten!$G23)+L$10*LOG(Grunddaten!$F23)+L$11*LOG(Grunddaten!$H23)","v":{"$error":"#NUM!"}},{"$f":"M$8+M$9*LOG(Grunddaten!$G23)+M$10*LOG(Grunddaten!$F23)+M$11*LOG(Grunddaten!$H23)","v":{"$error":"#NUM!"}},{"$f":"N$8+N$9*LOG(Grunddaten!$G23)+N$10*LOG(Grunddaten!$F23)+N$11*LOG(Grunddaten!$H23)","v":{"$error":"#NUM!"}},{"$f":"O$8+O$9*LOG(Grunddaten!$G23)+O$10*LOG(Grunddaten!$F23)+O$11*LOG(Grunddaten!$H23)","v":{"$error":"#NUM!"}},{"$f":"P$8+P$9*LOG(Grunddaten!$G23)+P$10*LOG(Grunddaten!$F23)+P$11*LOG(Grunddaten!$H23)","v":{"$error":"#NUM!"}},{"$f":"Q$8+Q$9*LOG(Grunddaten!$G23)+Q$10*LOG(Grunddaten!$F23)+Q$11*LOG(Grunddaten!$H23)","v":{"$error":"#NUM!"}},{"$f":"R$8+R$9*LOG(Grunddaten!$G23)+R$10*LOG(Grunddaten!$F23)+R$11*LOG(Grunddaten!$H23)","v":{"$error":"#NUM!"}},{"$f":"S$8+S$9*LOG(Grunddaten!$G23)+S$10*LOG(Grunddaten!$F23)+S$11*LOG(Grunddaten!$H23)","v":{"$error":"#NUM!"}},{"$f":"T$8+T$9*LOG(Grunddaten!$G23)+T$10*LOG(Grunddaten!$F23)+T$11*LOG(Grunddaten!$H23)","v":{"$error":"#NUM!"}},{"$f":"U$8+U$9*LOG(Grunddaten!$G23)+U$10*LOG(Grunddaten!$F23)+U$11*LOG(Grunddaten!$H23)","v":{"$error":"#NUM!"}},{"$f":"V$8+V$9*LOG(Grunddaten!$G23)+V$10*LOG(Grunddaten!$F23)+V$11*LOG(Grunddaten!$H23)","v":{"$error":"#NUM!"}},{"$error":"#NUM!"}]
[{"$f":"Grunddaten!C24","v":"DIA315"},{"$f":"B$8+B$9*LOG(Grunddaten!$G24)+B$10*LOG(Grunddaten!$F24)+B$11*LOG(Grunddaten!$H24)","v":{"$error":"#NUM!"}},{"$f":"C$8+C$9*LOG(Grunddaten!$G24)+C$10*LOG(Grunddaten!$F24)+C$11*LOG(Grunddaten!$H24)","v":{"$error":"#NUM!"}},{"$f":"D$8+D$9*LOG(Grunddaten!$G24)+D$10*LOG(Grunddaten!$F24)+D$11*LOG(Grunddaten!$H24)","v":{"$error":"#NUM!"}},{"$f":"E$8+E$9*LOG(Grunddaten!$G24)+E$10*LOG(Grunddaten!$F24)+E$11*LOG(Grunddaten!$H24)","v":{"$error":"#NUM!"}},{"$f":"F$8+F$9*LOG(Grunddaten!$G24)+F$10*LOG(Grunddaten!$F24)+F$11*LOG(Grunddaten!$H24)","v":{"$error":"#NUM!"}},{"$f":"G$8+G$9*LOG(Grunddaten!$G24)+G$10*LOG(Grunddaten!$F24)+G$11*LOG(Grunddaten!$H24)","v":{"$error":"#NUM!"}},{"$f":"H$8+H$9*LOG(Grunddaten!$G24)+H$10*LOG(Grunddaten!$F24)+H$11*LOG(Grunddaten!$H24)","v":{"$error":"#NUM!"}},{"$f":"I$8+I$9*LOG(Grunddaten!$G24)+I$10*LOG(Grunddaten!$F24)+I$11*LOG(Grunddaten!$H24)","v":{"$error":"#NUM!"}},{"$f":"J$8+J$9*LOG(Grunddaten!$G24)+J$10*LOG(Grunddaten!$F24)+J$11*LOG(Grunddaten!$H24)","v":{"$error":"#NUM!"}},{"$f":"K$8+K$9*LOG(Grunddaten!$G24)+K$10*LOG(Grunddaten!$F24)+K$11*LOG(Grunddaten!$H24)","v":{"$error":"#NUM!"}},{"$f":"L$8+L$9*LOG(Grunddaten!$G24)+L$10*LOG(Grunddaten!$F24)+L$11*LOG(Grunddaten!$H24)","v":{"$error":"#NUM!"}},{"$f":"M$8+M$9*LOG(Grunddaten!$G24)+M$10*LOG(Grunddaten!$F24)+M$11*LOG(Grunddaten!$H24)","v":{"$error":"#NUM!"}},{"$f":"N$8+N$9*LOG(Grunddaten!$G24)+N$10*LOG(Grunddaten!$F24)+N$11*LOG(Grunddaten!$H24)","v":{"$error":"#NUM!"}},{"$f":"O$8+O$9*LOG(Grunddaten!$G24)+O$10*LOG(Grunddaten!$F24)+O$11*LOG(Grunddaten!$H24)","v":{"$error":"#NUM!"}},{"$f":"P$8+P$9*LOG(Grunddaten!$G24)+P$10*LOG(Grunddaten!$F24)+P$11*LOG(Grunddaten!$H24)","v":{"$error":"#NUM!"}},{"$f":"Q$8+Q$9*LOG(Grunddaten!$G24)+Q$10*LOG(Grunddaten!$F24)+Q$11*LOG(Grunddaten!$H24)","v":{"$error":"#NUM!"}},{"$f":"R$8+R$9*LOG(Grunddaten!$G24)+R$10*LOG(Grunddaten!$F24)+R$11*LOG(Grunddaten!$H24)","v":{"$error":"#NUM!"}},{"$f":"S$8+S$9*LOG(Grunddaten!$G24)+S$10*LOG(Grunddaten!$F24)+S$11*LOG(Grunddaten!$H24)","v":{"$error":"#NUM!"}},{"$f":"T$8+T$9*LOG(Grunddaten!$G24)+T$10*LOG(Grunddaten!$F24)+T$11*LOG(Grunddaten!$H24)","v":{"$error":"#NUM!"}},{"$f":"U$8+U$9*LOG(Grunddaten!$G24)+U$10*LOG(Grunddaten!$F24)+U$11*LOG(Grunddaten!$H24)","v":{"$error":"#NUM!"}},{"$f":"V$8+V$9*LOG(Grunddaten!$G24)+V$10*LOG(Grunddaten!$F24)+V$11*LOG(Grunddaten!$H24)","v":{"$error":"#NUM!"}},{"$error":"#NUM!"}]
[{"$f":"Grunddaten!C25","v":"DIA355"},{"$f":"B$8+B$9*LOG(Grunddaten!$G25)+B$10*LOG(Grunddaten!$F25)+B$11*LOG(Grunddaten!$H25)","v":{"$error":"#NUM!"}},{"$f":"C$8+C$9*LOG(Grunddaten!$G25)+C$10*LOG(Grunddaten!$F25)+C$11*LOG(Grunddaten!$H25)","v":{"$error":"#NUM!"}},{"$f":"D$8+D$9*LOG(Grunddaten!$G25)+D$10*LOG(Grunddaten!$F25)+D$11*LOG(Grunddaten!$H25)","v":{"$error":"#NUM!"}},{"$f":"E$8+E$9*LOG(Grunddaten!$G25)+E$10*LOG(Grunddaten!$F25)+E$11*LOG(Grunddaten!$H25)","v":{"$error":"#NUM!"}},{"$f":"F$8+F$9*LOG(Grunddaten!$G25)+F$10*LOG(Grunddaten!$F25)+F$11*LOG(Grunddaten!$H25)","v":{"$error":"#NUM!"}},{"$f":"G$8+G$9*LOG(Grunddaten!$G25)+G$10*LOG(Grunddaten!$F25)+G$11*LOG(Grunddaten!$H25)","v":{"$error":"#NUM!"}},{"$f":"H$8+H$9*LOG(Grunddaten!$G25)+H$10*LOG(Grunddaten!$F25)+H$11*LOG(Grunddaten!$H25)","v":{"$error":"#NUM!"}},{"$f":"I$8+I$9*LOG(Grunddaten!$G25)+I$10*LOG(Grunddaten!$F25)+I$11*LOG(Grunddaten!$H25)","v":{"$error":"#NUM!"}},{"$f":"J$8+J$9*LOG(Grunddaten!$G25)+J$10*LOG(Grunddaten!$F25)+J$11*LOG(Grunddaten!$H25)","v":{"$error":"#NUM!"}},{"$f":"K$8+K$9*LOG(Grunddaten!$G25)+K$10*LOG(Grunddaten!$F25)+K$11*LOG(Grunddaten!$H25)","v":{"$error":"#NUM!"}},{"$f":"L$8+L$9*LOG(Grunddaten!$G25)+L$10*LOG(Grunddaten!$F25)+L$11*LOG(Grunddaten!$H25)","v":{"$error":"#NUM!"}},{"$f":"M$8+M$9*LOG(Grunddaten!$G25)+M$10*LOG(Grunddaten!$F25)+M$11*LOG(Grunddaten!$H25)","v":{"$error":"#NUM!"}},{"$f":"N$8+N$9*LOG(Grunddaten!$G25)+N$10*LOG(Grunddaten!$F25)+N$11*LOG(Grunddaten!$H25)","v":{"$error":"#NUM!"}},{"$f":"O$8+O$9*LOG(Grunddaten!$G25)+O$10*LOG(Grunddaten!$F25)+O$11*LOG(Grunddaten!$H25)","v":{"$error":"#NUM!"}},{"$f":"P$8+P$9*LOG(Grunddaten!$G25)+P$10*LOG(Grunddaten!$F25)+P$11*LOG(Grunddaten!$H25)","v":{"$error":"#NUM!"}},{"$f":"Q$8+Q$9*LOG(Grunddaten!$G25)+Q$10*LOG(Grunddaten!$F25)+Q$11*LOG(Grunddaten!$H25)","v":{"$error":"#NUM!"}},{"$f":"R$8+R$9*LOG(Grunddaten!$G25)+R$10*LOG(Grunddaten!$F25)+R$11*LOG(Grunddaten!$H25)","v":{"$error":"#NUM!"}},{"$f":"S$8+S$9*LOG(Grunddaten!$G25)+S$10*LOG(Grunddaten!$F25)+S$11*LOG(Grunddaten!$H25)","v":{"$error":"#NUM!"}},{"$f":"T$8+T$9*LOG(Grunddaten!$G25)+T$10*LOG(Grunddaten!$F25)+T$11*LOG(Grunddaten!$H25)","v":{"$error":"#NUM!"}},{"$f":"U$8+U$9*LOG(Grunddaten!$G25)+U$10*LOG(Grunddaten!$F25)+U$11*LOG(Grunddaten!$H25)","v":{"$error":"#NUM!"}},{"$f":"V$8+V$9*LOG(Grunddaten!$G25)+V$10*LOG(Grunddaten!$F25)+V$11*LOG(Grunddaten!$H25)","v":{"$error":"#NUM!"}},{"$error":"#NUM!"}]
[{"$f":"Grunddaten!C26","v":"MSA300"},{"$f":"B$8+B$9*LOG(Grunddaten!$G26)+B$10*LOG(Grunddaten!$F26)+B$11*LOG(Grunddaten!$H26)","v":{"$error":"#NUM!"}},{"$f":"C$8+C$9*LOG(Grunddaten!$G26)+C$10*LOG(Grunddaten!$F26)+C$11*LOG(Grunddaten!$H26)","v":{"$error":"#NUM!"}},{"$f":"D$8+D$9*LOG(Grunddaten!$G26)+D$10*LOG(Grunddaten!$F26)+D$11*LOG(Grunddaten!$H26)","v":{"$error":"#NUM!"}},{"$f":"E$8+E$9*LOG(Grunddaten!$G26)+E$10*LOG(Grunddaten!$F26)+E$11*LOG(Grunddaten!$H26)","v":{"$error":"#NUM!"}},{"$f":"F$8+F$9*LOG(Grunddaten!$G26)+F$10*LOG(Grunddaten!$F26)+F$11*LOG(Grunddaten!$H26)","v":{"$error":"#NUM!"}},{"$f":"G$8+G$9*LOG(Grunddaten!$G26)+G$10*LOG(Grunddaten!$F26)+G$11*LOG(Grunddaten!$H26)","v":{"$error":"#NUM!"}},{"$f":"H$8+H$9*LOG(Grunddaten!$G26)+H$10*LOG(Grunddaten!$F26)+H$11*LOG(Grunddaten!$H26)","v":{"$error":"#NUM!"}},{"$f":"I$8+I$9*LOG(Grunddaten!$G26)+I$10*LOG(Grunddaten!$F26)+I$11*LOG(Grunddaten!$H26)","v":{"$error":"#NUM!"}},{"$f":"J$8+J$9*LOG(Grunddaten!$G26)+J$10*LOG(Grunddaten!$F26)+J$11*LOG(Grunddaten!$H26)","v":{"$error":"#NUM!"}},{"$f":"K$8+K$9*LOG(Grunddaten!$G26)+K$10*LOG(Grunddaten!$F26)+K$11*LOG(Grunddaten!$H26)","v":{"$error":"#NUM!"}},{"$f":"L$8+L$9*LOG(Grunddaten!$G26)+L$10*LOG(Grunddaten!$F26)+L$11*LOG(Grunddaten!$H26)","v":{"$error":"#NUM!"}},{"$f":"M$8+M$9*LOG(Grunddaten!$G26)+M$10*LOG(Grunddaten!$F26)+M$11*LOG(Grunddaten!$H26)","v":{"$error":"#NUM!"}},{"$f":"N$8+N$9*LOG(Grunddaten!$G26)+N$10*LOG(Grunddaten!$F26)+N$11*LOG(Grunddaten!$H26)","v":{"$error":"#NUM!"}},{"$f":"O$8+O$9*LOG(Grunddaten!$G26)+O$10*LOG(Grunddaten!$F26)+O$11*LOG(Grunddaten!$H26)","v":{"$error":"#NUM!"}},{"$f":"P$8+P$9*LOG(Grunddaten!$G26)+P$10*LOG(Grunddaten!$F26)+P$11*LOG(Grunddaten!$H26)","v":{"$error":"#NUM!"}},{"$f":"Q$8+Q$9*LOG(Grunddaten!$G26)+Q$10*LOG(Grunddaten!$F26)+Q$11*LOG(Grunddaten!$H26)","v":{"$error":"#NUM!"}},{"$f":"R$8+R$9*LOG(Grunddaten!$G26)+R$10*LOG(Grunddaten!$F26)+R$11*LOG(Grunddaten!$H26)","v":{"$error":"#NUM!"}},{"$f":"S$8+S$9*LOG(Grunddaten!$G26)+S$10*LOG(Grunddaten!$F26)+S$11*LOG(Grunddaten!$H26)","v":{"$error":"#NUM!"}},{"$f":"T$8+T$9*LOG(Grunddaten!$G26)+T$10*LOG(Grunddaten!$F26)+T$11*LOG(Grunddaten!$H26)","v":{"$error":"#NUM!"}},{"$f":"U$8+U$9*LOG(Grunddaten!$G26)+U$10*LOG(Grunddaten!$F26)+U$11*LOG(Grunddaten!$H26)","v":{"$error":"#NUM!"}},{"$f":"V$8+V$9*LOG(Grunddaten!$G26)+V$10*LOG(Grunddaten!$F26)+V$11*LOG(Grunddaten!$H26)","v":{"$error":"#NUM!"}},{"$error":"#NUM!"}]
[{"$f":"Grunddaten!C27","v":"MSA400"},{"$f":"B$8+B$9*LOG(Grunddaten!$G27)+B$10*LOG(Grunddaten!$F27)+B$11*LOG(Grunddaten!$H27)","v":{"$error":"#NUM!"}},{"$f":"C$8+C$9*LOG(Grunddaten!$G27)+C$10*LOG(Grunddaten!$F27)+C$11*LOG(Grunddaten!$H27)","v":{"$error":"#NUM!"}},{"$f":"D$8+D$9*LOG(Grunddaten!$G27)+D$10*LOG(Grunddaten!$F27)+D$11*LOG(Grunddaten!$H27)","v":{"$error":"#NUM!"}},{"$f":"E$8+E$9*LOG(Grunddaten!$G27)+E$10*LOG(Grunddaten!$F27)+E$11*LOG(Grunddaten!$H27)","v":{"$error":"#NUM!"}},{"$f":"F$8+F$9*LOG(Grunddaten!$G27)+F$10*LOG(Grunddaten!$F27)+F$11*LOG(Grunddaten!$H27)","v":{"$error":"#NUM!"}},{"$f":"G$8+G$9*LOG(Grunddaten!$G27)+G$10*LOG(Grunddaten!$F27)+G$11*LOG(Grunddaten!$H27)","v":{"$error":"#NUM!"}},{"$f":"H$8+H$9*LOG(Grunddaten!$G27)+H$10*LOG(Grunddaten!$F27)+H$11*LOG(Grunddaten!$H27)","v":{"$error":"#NUM!"}},{"$f":"I$8+I$9*LOG(Grunddaten!$G27)+I$10*LOG(Grunddaten!$F27)+I$11*LOG(Grunddaten!$H27)","v":{"$error":"#NUM!"}},{"$f":"J$8+J$9*LOG(Grunddaten!$G27)+J$10*LOG(Grunddaten!$F27)+J$11*LOG(Grunddaten!$H27)","v":{"$error":"#NUM!"}},{"$f":"K$8+K$9*LOG(Grunddaten!$G27)+K$10*LOG(Grunddaten!$F27)+K$11*LOG(Grunddaten!$H27)","v":{"$error":"#NUM!"}},{"$f":"L$8+L$9*LOG(Grunddaten!$G27)+L$10*LOG(Grunddaten!$F27)+L$11*LOG(Grunddaten!$H27)","v":{"$error":"#NUM!"}},{"$f":"M$8+M$9*LOG(Grunddaten!$G27)+M$10*LOG(Grunddaten!$F27)+M$11*LOG(Grunddaten!$H27)","v":{"$error":"#NUM!"}},{"$f":"N$8+N$9*LOG(Grunddaten!$G27)+N$10*LOG(Grunddaten!$F27)+N$11*LOG(Grunddaten!$H27)","v":{"$error":"#NUM!"}},{"$f":"O$8+O$9*LOG(Grunddaten!$G27)+O$10*LOG(Grunddaten!$F27)+O$11*LOG(Grunddaten!$H27)","v":{"$error":"#NUM!"}},{"$f":"P$8+P$9*LOG(Grunddaten!$G27)+P$10*LOG(Grunddaten!$F27)+P$11*LOG(Grunddaten!$H27)","v":{"$error":"#NUM!"}},{"$f":"Q$8+Q$9*LOG(Grunddaten!$G27)+Q$10*LOG(Grunddaten!$F27)+Q$11*LOG(Grunddaten!$H27)","v":{"$error":"#NUM!"}},{"$f":"R$8+R$9*LOG(Grunddaten!$G27)+R$10*LOG(Grunddaten!$F27)+R$11*LOG(Grunddaten!$H27)","v":{"$error":"#NUM!"}},{"$f":"S$8+S$9*LOG(Grunddaten!$G27)+S$10*LOG(Grunddaten!$F27)+S$11*LOG(Grunddaten!$H27)","v":{"$error":"#NUM!"}},{"$f":"T$8+T$9*LOG(Grunddaten!$G27)+T$10*LOG(Grunddaten!$F27)+T$11*LOG(Grunddaten!$H27)","v":{"$error":"#NUM!"}},{"$f":"U$8+U$9*LOG(Grunddaten!$G27)+U$10*LOG(Grunddaten!$F27)+U$11*LOG(Grunddaten!$H27)","v":{"$error":"#NUM!"}},{"$f":"V$8+V$9*LOG(Grunddaten!$G27)+V$10*LOG(Grunddaten!$F27)+V$11*LOG(Grunddaten!$H27)","v":{"$error":"#NUM!"}},{"$error":"#NUM!"}]
[{"$f":"Grunddaten!C28","v":"MSA500"},{"$f":"B$8+B$9*LOG(Grunddaten!$G28)+B$10*LOG(Grunddaten!$F28)+B$11*LOG(Grunddaten!$H28)","v":{"$error":"#NUM!"}},{"$f":"C$8+C$9*LOG(Grunddaten!$G28)+C$10*LOG(Grunddaten!$F28)+C$11*LOG(Grunddaten!$H28)","v":{"$error":"#NUM!"}},{"$f":"D$8+D$9*LOG(Grunddaten!$G28)+D$10*LOG(Grunddaten!$F28)+D$11*LOG(Grunddaten!$H28)","v":{"$error":"#NUM!"}},{"$f":"E$8+E$9*LOG(Grunddaten!$G28)+E$10*LOG(Grunddaten!$F28)+E$11*LOG(Grunddaten!$H28)","v":{"$error":"#NUM!"}},{"$f":"F$8+F$9*LOG(Grunddaten!$G28)+F$10*LOG(Grunddaten!$F28)+F$11*LOG(Grunddaten!$H28)","v":{"$error":"#NUM!"}},{"$f":"G$8+G$9*LOG(Grunddaten!$G28)+G$10*LOG(Grunddaten!$F28)+G$11*LOG(Grunddaten!$H28)","v":{"$error":"#NUM!"}},{"$f":"H$8+H$9*LOG(Grunddaten!$G28)+H$10*LOG(Grunddaten!$F28)+H$11*LOG(Grunddaten!$H28)","v":{"$error":"#NUM!"}},{"$f":"I$8+I$9*LOG(Grunddaten!$G28)+I$10*LOG(Grunddaten!$F28)+I$11*LOG(Grunddaten!$H28)","v":{"$error":"#NUM!"}},{"$f":"J$8+J$9*LOG(Grunddaten!$G28)+J$10*LOG(Grunddaten!$F28)+J$11*LOG(Grunddaten!$H28)","v":{"$error":"#NUM!"}},{"$f":"K$8+K$9*LOG(Grunddaten!$G28)+K$10*LOG(Grunddaten!$F28)+K$11*LOG(Grunddaten!$H28)","v":{"$error":"#NUM!"}},{"$f":"L$8+L$9*LOG(Grunddaten!$G28)+L$10*LOG(Grunddaten!$F28)+L$11*LOG(Grunddaten!$H28)","v":{"$error":"#NUM!"}},{"$f":"M$8+M$9*LOG(Grunddaten!$G28)+M$10*LOG(Grunddaten!$F28)+M$11*LOG(Grunddaten!$H28)","v":{"$error":"#NUM!"}},{"$f":"N$8+N$9*LOG(Grunddaten!$G28)+N$10*LOG(Grunddaten!$F28)+N$11*LOG(Grunddaten!$H28)","v":{"$error":"#NUM!"}},{"$f":"O$8+O$9*LOG(Grunddaten!$G28)+O$10*LOG(Grunddaten!$F28)+O$11*LOG(Grunddaten!$H28)","v":{"$error":"#NUM!"}},{"$f":"P$8+P$9*LOG(Grunddaten!$G28)+P$10*LOG(Grunddaten!$F28)+P$11*LOG(Grunddaten!$H28)","v":{"$error":"#NUM!"}},{"$f":"Q$8+Q$9*LOG(Grunddaten!$G28)+Q$10*LOG(Grunddaten!$F28)+Q$11*LOG(Grunddaten!$H28)","v":{"$error":"#NUM!"}},{"$f":"R$8+R$9*LOG(Grunddaten!$G28)+R$10*LOG(Grunddaten!$F28)+R$11*LOG(Grunddaten!$H28)","v":{"$error":"#NUM!"}},{"$f":"S$8+S$9*LOG(Grunddaten!$G28)+S$10*LOG(Grunddaten!$F28)+S$11*LOG(Grunddaten!$H28)","v":{"$error":"#NUM!"}},{"$f":"T$8+T$9*LOG(Grunddaten!$G28)+T$10*LOG(Grunddaten!$F28)+T$11*LOG(Grunddaten!$H28)","v":{"$error":"#NUM!"}},{"$f":"U$8+U$9*LOG(Grunddaten!$G28)+U$10*LOG(Grunddaten!$F28)+U$11*LOG(Grunddaten!$H28)","v":{"$error":"#NUM!"}},{"$f":"V$8+V$9*LOG(Grunddaten!$G28)+V$10*LOG(Grunddaten!$F28)+V$11*LOG(Grunddaten!$H28)","v":{"$error":"#NUM!"}},{"$error":"#NUM!"}]
[{"$f":"Grunddaten!C29","v":"MSA600"},{"$f":"B$8+B$9*LOG(Grunddaten!$G29)+B$10*LOG(Grunddaten!$F29)+B$11*LOG(Grunddaten!$H29)","v":{"$error":"#NUM!"}},{"$f":"C$8+C$9*LOG(Grunddaten!$G29)+C$10*LOG(Grunddaten!$F29)+C$11*LOG(Grunddaten!$H29)","v":{"$error":"#NUM!"}},{"$f":"D$8+D$9*LOG(Grunddaten!$G29)+D$10*LOG(Grunddaten!$F29)+D$11*LOG(Grunddaten!$H29)","v":{"$error":"#NUM!"}},{"$f":"E$8+E$9*LOG(Grunddaten!$G29)+E$10*LOG(Grunddaten!$F29)+E$11*LOG(Grunddaten!$H29)","v":{"$error":"#NUM!"}},{"$f":"F$8+F$9*LOG(Grunddaten!$G29)+F$10*LOG(Grunddaten!$F29)+F$11*LOG(Grunddaten!$H29)","v":{"$error":"#NUM!"}},{"$f":"G$8+G$9*LOG(Grunddaten!$G29)+G$10*LOG(Grunddaten!$F29)+G$11*LOG(Grunddaten!$H29)","v":{"$error":"#NUM!"}},{"$f":"H$8+H$9*LOG(Grunddaten!$G29)+H$10*LOG(Grunddaten!$F29)+H$11*LOG(Grunddaten!$H29)","v":{"$error":"#NUM!"}},{"$f":"I$8+I$9*LOG(Grunddaten!$G29)+I$10*LOG(Grunddaten!$F29)+I$11*LOG(Grunddaten!$H29)","v":{"$error":"#NUM!"}},{"$f":"J$8+J$9*LOG(Grunddaten!$G29)+J$10*LOG(Grunddaten!$F29)+J$11*LOG(Grunddaten!$H29)","v":{"$error":"#NUM!"}},{"$f":"K$8+K$9*LOG(Grunddaten!$G29)+K$10*LOG(Grunddaten!$F29)+K$11*LOG(Grunddaten!$H29)","v":{"$error":"#NUM!"}},{"$f":"L$8+L$9*LOG(Grunddaten!$G29)+L$10*LOG(Grunddaten!$F29)+L$11*LOG(Grunddaten!$H29)","v":{"$error":"#NUM!"}},{"$f":"M$8+M$9*LOG(Grunddaten!$G29)+M$10*LOG(Grunddaten!$F29)+M$11*LOG(Grunddaten!$H29)","v":{"$error":"#NUM!"}},{"$f":"N$8+N$9*LOG(Grunddaten!$G29)+N$10*LOG(Grunddaten!$F29)+N$11*LOG(Grunddaten!$H29)","v":{"$error":"#NUM!"}},{"$f":"O$8+O$9*LOG(Grunddaten!$G29)+O$10*LOG(Grunddaten!$F29)+O$11*LOG(Grunddaten!$H29)","v":{"$error":"#NUM!"}},{"$f":"P$8+P$9*LOG(Grunddaten!$G29)+P$10*LOG(Grunddaten!$F29)+P$11*LOG(Grunddaten!$H29)","v":{"$error":"#NUM!"}},{"$f":"Q$8+Q$9*LOG(Grunddaten!$G29)+Q$10*LOG(Grunddaten!$F29)+Q$11*LOG(Grunddaten!$H29)","v":{"$error":"#NUM!"}},{"$f":"R$8+R$9*LOG(Grunddaten!$G29)+R$10*LOG(Grunddaten!$F29)+R$11*LOG(Grunddaten!$H29)","v":{"$error":"#NUM!"}},{"$f":"S$8+S$9*LOG(Grunddaten!$G29)+S$10*LOG(Grunddaten!$F29)+S$11*LOG(Grunddaten!$H29)","v":{"$error":"#NUM!"}},{"$f":"T$8+T$9*LOG(Grunddaten!$G29)+T$10*LOG(Grunddaten!$F29)+T$11*LOG(Grunddaten!$H29)","v":{"$error":"#NUM!"}},{"$f":"U$8+U$9*LOG(Grunddaten!$G29)+U$10*LOG(Grunddaten!$F29)+U$11*LOG(Grunddaten!$H29)","v":{"$error":"#NUM!"}},{"$f":"V$8+V$9*LOG(Grunddaten!$G29)+V$10*LOG(Grunddaten!$F29)+V$11*LOG(Grunddaten!$H29)","v":{"$error":"#NUM!"}},{"$error":"#NUM!"}]
[]
[]
["Werteübergabe für klassische CAP-Berechnung:",null,null,"Durchlass:",{"$f":"Auslegung!$D$12","v":"DAL 358"},"K021",{"$f":"SUM('DAL359-CAP'!$C$42,'DAL358-CAP'!$C$42,'DRS-CAP'!$C$42,'DIA-CAP'!$C$42,'MSA-CAP'!$C$42)","v":-141.4},null,"K021Abluft",{"$f":"IF(SUM('DAL359-CAP'!$C$66,'DAL358-CAP'!$C$66,'DRS-CAP'!$C$66,'DIA-CAP'!$C$66,'MSA-CAP'!$C$66)=0,\"\",SUM('DAL359-CAP'!$C$66,'DAL358-CAP'!$C$66,'DRS-CAP'!$C$66,'DIA-CAP'!$C$66,'MSA-CAP'!$C$66))","v":""}]
[null,null,null,"Lochbild:",{"$f":"Auslegung!$D$25","v":800},"K022",{"$f":"SUM('DAL359-CAP'!$C$43,'DAL358-CAP'!$C$43,'DRS-CAP'!$C$43,'DIA-CAP'!$C$43,'MSA-CAP'!$C$43)","v":62.47},null,"K022Abluft",{"$f":"IF(SUM('DAL359-CAP'!$C$67,'DAL358-CAP'!$C$67,'DRS-CAP'!$C$67,'DIA-CAP'!$C$67,'MSA-CAP'!$C$67)=0,\"\",SUM('DAL359-CAP'!$C$67,'DAL358-CAP'!$C$67,'DRS-CAP'!$C$67,'DIA-CAP'!$C$67,'MSA-CAP'!$C$67))","v":""}]
[]
[null,"Oktav-Relativspektrum fOkt [Hz] ZULUFT",null,null,null,null,null,null,"SLWA "]
[null,125,250,500,1000,2000,4000,8000,"Summe"]
[{"$f":"A24","v":"DAL 359300"},-9.7481650013372345,-2.3587979588175259,-8.6284171069790396,-9.7175223323966158,-15.488593552715576,-20.713306574136702,-22.676323641380847,{"$f":"10*LOG(10^(0.1*B57)+10^(0.1*C57)+10^(0.1*D57)+10^(0.1*E57)+10^(0.1*F57)+10^(0.1*G57)+10^(0.1*H57))","v":-0.1193317217202815},null,"Relativspektrum vom DAL 359DN 300 übernommen vom DN 400!"]
["DAL 359400",-9.7481650013372345,-2.3587979588175259,-8.6284171069790396,-9.7175223323966158,-15.488593552715576,-20.713306574136702,-22.676323641380847,{"$f":"10*LOG(10^(0.1*B58)+10^(0.1*C58)+10^(0.1*D58)+10^(0.1*E58)+10^(0.1*F58)+10^(0.1*G58)+10^(0.1*H58))","v":-0.1193317217202815},null,"Datenherkunft: \\\\EMCO-WI\\Daten\\daten_EK\\EMCOAIR\\DAL 359\\Berechnung_Oktavspektrum_DAL359_150203"]
["DAL 359500",-7.5505901398238313,-2.9953083681659667,-7.4184113455662226,-10.164842116704346,-17.355090116045091,-24.733287826402485,-28.108746230611157,-9.5423132291552026E-2]
["DAL 359600",-5.7753341730164944,-3.6752977710720978,-6.9781506608245367,-11.092871630745268,-20.069696131964729,-26.685299215509477,-28.430748259604446,-6.4563139503207426E-2]
["DAL 359800",-3.305960812245806,-6.6999251162462627,-6.2229955985621448,-13.345901833733191,-23.797105810964002,-29.884675938480335,-30.393665847139442,-0.12376871727074432]
["DAL 358300",-18.150745478711915,-8.3494741751730537,-6.8400120164211291,-4.9910253438539129,-9.4439800475119355,-12.03691857171575,-18.148920600862759,{"$f":"10*LOG(10^(0.1*B62)+10^(0.1*C62)+10^(0.1*D62)+10^(0.1*E62)+10^(0.1*F62)+10^(0.1*G62)+10^(0.1*H62))","v":-0.57013283674900006},null,"Relativspektrum vom DAL 358DN 300 übernommen vom DN 400!"]
["DAL 358400",-18.150745478711915,-8.3494741751730537,-6.8400120164211291,-4.9910253438539129,-9.4439800475119355,-12.03691857171575,-18.148920600862759,{"$f":"10*LOG(10^(0.1*B63)+10^(0.1*C63)+10^(0.1*D63)+10^(0.1*E63)+10^(0.1*F63)+10^(0.1*G63)+10^(0.1*H63))","v":-0.57013283674900006}]
["DAL 358500",-14.77992515922576,-7.3385135967784958,-5.3339048661276607,-5.2439116794572431,-10.708244158018617,-15.490565190587953,-22.171153887406692,{"$f":"10*LOG(10^(0.1*B64)+10^(0.1*C64)+10^(0.1*D64)+10^(0.1*E64)+10^(0.1*F64)+10^(0.1*G64)+10^(0.1*H64))","v":-0.32041565958029339}]
[{"$f":"A32","v":"DAL 358600"},-12.603601966536422,-6.4939407232442043,-5.2528307463618047,-6.1078966227421168,-11.58787682844906,-14.266274872057245,-21.850307567180526,{"$f":"10*LOG(10^(0.1*B65)+10^(0.1*C65)+10^(0.1*D65)+10^(0.1*E65)+10^(0.1*F65)+10^(0.1*G65)+10^(0.1*H65))","v":-0.28811202986208012}]
["DAL 358800",-12.603601966536422,-6.4939407232442043,-5.2528307463618047,-6.1078966227421168,-11.58787682844906,-14.266274872057245,-21.850307567180526,-0.28811202986208012,null,"Relativspektrum vom DAL 358DN 800 übernommen vom DN 600!"]
["DRS100",-10.488729651925572,-6.2254326601136647,-5.5489447757520907,-8.2003276653433552,-10.616127648943188,-14.449296165477813,-17.537915995993696,-0.46644558945240167]
["DRS125",-10.549518941200013,-5.6121204314631363,-5.6231139897848319,-8.8148353841675693,-11.114566076839031,-15.068470138269737,-17.474005865722596,-0.48424780459377204]
["DRS180",-7.8936146940759162,-5.204997645487218,-6.2025370657272978,-10.063980474231226,-13.635952827853512,-16.896476806237491,-17.614304728906198,-0.53845162649386469]
["DRS250",-11.040862123816998,-7.9722442061574537,-5.3046351018564852,-5.3447156076924527,-10.345655552401759,-16.174411468783212,-20.653678488333298,-0.22193814982778323]
["DRS315",-6.6386516355853811,-6.6194035188932876,-6.6716339595975569,-6.6264923245051177,-11.08365290338163,-19.917954594816525,-24.050926832333211,-0.18034556233566504]
["DRS355",-5.8094503652809575,-6.0391182012988196,-6.9990448310607949,-7.8021983109555162,-13.58122566443355,-20.339507976008445,-21.393267337109837,-0.28176761411123541]
["DIA100",{"$f":"10*LOG(10^(0.1*#REF!)+10^(0.1*#REF!)+10^(0.1*#REF!))","v":{"$error":"#REF!"}},{"$f":"10*LOG(10^(0.1*#REF!)+10^(0.1*#REF!)+10^(0.1*#REF!))","v":{"$error":"#REF!"}},{"$f":"10*LOG(10^(0.1*#REF!)+10^(0.1*#REF!)+10^(0.1*#REF!))","v":{"$error":"#REF!"}},{"$f":"10*LOG(10^(0.1*#REF!)+10^(0.1*#REF!)+10^(0.1*#REF!))","v":{"$error":"#REF!"}},{"$f":"10*LOG(10^(0.1*#REF!)+10^(0.1*#REF!)+10^(0.1*#REF!))","v":{"$error":"#REF!"}},{"$f":"10*LOG(10^(0.1*#REF!)+10^(0.1*#REF!)+10^(0.1*#REF!))","v":{"$error":"#REF!"}},{"$f":"10*LOG(10^(0.1*#REF!)+10^(0.1*#REF!)+10^(0.1*#REF!))","v":{"$error":"#REF!"}},{"$f":"10*LOG(10^(0.1*B73)+10^(0.1*C73)+10^(0.1*D73)+10^(0.1*E73)+10^(0.1*F73)+10^(0.1*G73)+10^(0.1*H73))","v":{"$error":"#REF!"}}]
["DIA125",{"$f":"10*LOG(10^(0.1*#REF!)+10^(0.1*#REF!)+10^(0.1*#REF!))","v":{"$error":"#REF!"}},{"$f":"10*LOG(10^(0.1*#REF!)+10^(0.1*#REF!)+10^(0.1*#REF!))","v":{"$error":"#REF!"}},{"$f":"10*LOG(10^(0.1*#REF!)+10^(0.1*#REF!)+10^(0.1*#REF!))","v":{"$error":"#REF!"}},{"$f":"10*LOG(10^(0.1*#REF!)+10^(0.1*#REF!)+10^(0.1*#REF!))","v":{"$error":"#REF!"}},{"$f":"10*LOG(10^(0.1*#REF!)+10^(0.1*#REF!)+10^(0.1*#REF!))","v":{"$error":"#REF!"}},{"$f":"10*LOG(10^(0.1*#REF!)+10^(0.1*#REF!)+10^(0.1*#REF!))","v":{"$error":"#REF!"}},{"$f":"10*LOG(10^(0.1*#REF!)+10^(0.1*#REF!)+10^(0.1*#REF!))","v":{"$error":"#REF!"}},{"$error":"#REF!"}]
["DIA180",{"$f":"10*LOG(10^(0.1*#REF!)+10^(0.1*#REF!)+10^(0.1*#REF!))","v":{"$error":"#REF!"}},{"$f":"10*LOG(10^(0.1*#REF!)+10^(0.1*#REF!)+10^(0.1*#REF!))","v":{"$error":"#REF!"}},{"$f":"10*LOG(10^(0.1*#REF!)+10^(0.1*#REF!)+10^(0.1*#REF!))","v":{"$error":"#REF!"}},{"$f":"10*LOG(10^(0.1*#REF!)+10^(0.1*#REF!)+10^(0.1*#REF!))","v":{"$error":"#REF!"}},{"$f":"10*LOG(10^(0.1*#REF!)+10^(0.1*#REF!)+10^(0.1*#REF!))","v":{"$error":"#REF!"}},{"$f":"10*LOG(10^(0.1*#REF!)+10^(0.1*#REF!)+10^(0.1*#REF!))","v":{"$error":"#REF!"}},{"$f":"10*LOG(10^(0.1*#REF!)+10^(0.1*#REF!)+10^(0.1*#REF!))","v":{"$error":"#REF!"}},{"$f":"10*LOG(10^(0.1*B75)+10^(0.1*C75)+10^(0.1*D75)+10^(0.1*E75)+10^(0.1*F75)+10^(0.1*G75)+10^(0.1*H75))","v":{"$error":"#REF!"}}]
["DIA250",{"$f":"10*LOG(10^(0.1*#REF!)+10^(0.1*#REF!)+10^(0.1*#REF!))","v":{"$error":"#REF!"}},{"$f":"10*LOG(10^(0.1*#REF!)+10^(0.1*#REF!)+10^(0.1*#REF!))","v":{"$error":"#REF!"}},{"$f":"10*LOG(10^(0.1*#REF!)+10^(0.1*#REF!)+10^(0.1*#REF!))","v":{"$error":"#REF!"}},{"$f":"10*LOG(10^(0.1*#REF!)+10^(0.1*#REF!)+10^(0.1*#REF!))","v":{"$error":"#REF!"}},{"$f":"10*LOG(10^(0.1*#REF!)+10^(0.1*#REF!)+10^(0.1*#REF!))","v":{"$error":"#REF!"}},{"$f":"10*LOG(10^(0.1*#REF!)+10^(0.1*#REF!)+10^(0.1*#REF!))","v":{"$error":"#REF!"}},{"$f":"10*LOG(10^(0.1*#REF!)+10^(0.1*#REF!)+10^(0.1*#REF!))","v":{"$error":"#REF!"}},{"$f":"10*LOG(10^(0.1*B76)+10^(0.1*C76)+10^(0.1*D76)+10^(0.1*E76)+10^(0.1*F76)+10^(0.1*G76)+10^(0.1*H76))","v":{"$error":"#REF!"}}]
["DIA315",{"$f":"10*LOG(10^(0.1*#REF!)+10^(0.1*#REF!)+10^(0.1*#REF!))","v":{"$error":"#REF!"}},{"$f":"10*LOG(10^(0.1*#REF!)+10^(0.1*#REF!)+10^(0.1*#REF!))","v":{"$error":"#REF!"}},{"$f":"10*LOG(10^(0.1*#REF!)+10^(0.1*#REF!)+10^(0.1*#REF!))","v":{"$error":"#REF!"}},{"$f":"10*LOG(10^(0.1*#REF!)+10^(0.1*#REF!)+10^(0.1*#REF!))","v":{"$error":"#REF!"}},{"$f":"10*LOG(10^(0.1*#REF!)+10^(0.1*#REF!)+10^(0.1*#REF!))","v":{"$error":"#REF!"}},{"$f":"10*LOG(10^(0.1*#REF!)+10^(0.1*#REF!)+10^(0.1*#REF!))","v":{"$error":"#REF!"}},{"$f":"10*LOG(10^(0.1*#REF!)+10^(0.1*#REF!)+10^(0.1*#REF!))","v":{"$error":"#REF!"}},{"$error":"#REF!"}]
["DIA355",{"$f":"10*LOG(10^(0.1*#REF!)+10^(0.1*#REF!)+10^(0.1*#REF!))","v":{"$error":"#REF!"}},{"$f":"10*LOG(10^(0.1*#REF!)+10^(0.1*#REF!)+10^(0.1*#REF!))","v":{"$error":"#REF!"}},{"$f":"10*LOG(10^(0.1*#REF!)+10^(0.1*#REF!)+10^(0.1*#REF!))","v":{"$error":"#REF!"}},{"$f":"10*LOG(10^(0.1*#REF!)+10^(0.1*#REF!)+10^(0.1*#REF!))","v":{"$error":"#REF!"}},{"$f":"10*LOG(10^(0.1*#REF!)+10^(0.1*#REF!)+10^(0.1*#REF!))","v":{"$error":"#REF!"}},{"$f":"10*LOG(10^(0.1*#REF!)+10^(0.1*#REF!)+10^(0.1*#REF!))","v":{"$error":"#REF!"}},{"$f":"10*LOG(10^(0.1*#REF!)+10^(0.1*#REF!)+10^(0.1*#REF!))","v":{"$error":"#REF!"}},{"$error":"#REF!"}]
["MSA300",-8.7960582009526895,-5.5280530233665344,-7.8839217987117411,-11.074434296005533,-15.375794568657676,-14.354695930733403,-11.267406430873127,-1.0060958422459036]
["MSA400",-15.89724876380525,-7.256522993908554,-5.9944329038965236,-5.9178348609354527,-12.132307906877694,-16.27902398126713,-21.911045665669079,-0.90177752515362353]
["MSA500",-12.275573305273594,-5.8514345745326386,-5.6634427552631292,-7.6766176504992814,-15.286130167072647,-19.102917801417171,-22.648565262955522,{"$f":"10*LOG(10^(0.1*B81)+10^(0.1*C81)+10^(0.1*D81)+10^(0.1*E81)+10^(0.1*F81)+10^(0.1*G81)+10^(0.1*H81))","v":-0.9223853573449502}]
["MSA600",-9.4955718375999556,-4.9546636487938782,-5.9656499834258261,-9.0435138599850404,-17.354544417830443,-20.927736147184834,-22.771186838019329,-0.74981356351910589]
[null,2,3,4,5,6,7,8,9]
["Gewählter Durchlass, Zuluft:"]
[{"$f":"CONCATENATE(E52,E53)","v":"DAL 358800"},{"$f":"VLOOKUP($A$85,$A$57:$H$82,B83,FALSE)","v":-12.603601966536422},{"$f":"VLOOKUP($A$85,$A$57:$H$82,C83,FALSE)","v":-6.4939407232442043},-5.2528307463618047,-6.1078966227421168,-11.58787682844906,-14.266274872057245,-21.850307567180526]
["Gewählter Durchlass, Abluft:"]
[{"$f":"CONCATENATE(E52,E53)","v":"DAL 358800"},{"$f":"VLOOKUP($A$87,$A$96:$H$121,B83,FALSE)","v":-7.5294770335353149},{"$f":"VLOOKUP($A$87,$A$96:$H$121,C83,FALSE)","v":-6.9707139217032958},-7.4620519822521389,-8.7549169893046344,-11.158502868250821,-13.562686648158024,-16.086877470013164]
["A-Bewertung:",-16.100000000000001,-8.6,-3.2,0,1.2,1,-1.1000000000000001]
[{"$f":"CONCATENATE(Auslegung!$D$8,\"ZUL\",Auslegung!$D$12,Auslegung!$D$18)","v":"ZULDAL 358800"},{"$f":"$I$89+B85","v":17.186855246168982},{"$f":"$I$89+C85","v":23.296516489461201},24.5376264663436,23.682560589963288,18.202580384256343,15.52418234064816,7.9401496455248797,{"$f":"IF($G$52+$G$53*LOG(Auslegung!$D$32)<25,\"<25\",$G$52+$G$53*LOG(Auslegung!$D$32))","v":29.790457212705405}]
[{"$f":"CONCATENATE(Auslegung!$D$8,\"ABL\",Auslegung!$D$12,Auslegung!$D$18)","v":"ABLDAL 358800"},{"$f":"$I$90+B87","v":{"$error":"#VALUE!"}},{"$f":"$I$90+C87","v":{"$error":"#VALUE!"}},{"$error":"#VALUE!"},{"$error":"#VALUE!"},{"$error":"#VALUE!"},{"$error":"#VALUE!"},{"$f":"$I$90+H87","v":{"$error":"#VALUE!"}},{"$f":"IF($J$52+$J$53*LOG(Auslegung!$D$32)<25,\"<25\",$J$52+$J$53*LOG(Auslegung!$D$32))","v":{"$error":"#VALUE!"}}]
["Rückgabe ZUL",{"$f":"IF($I$89=\"<25\",\"\",B89-B88)","v":33.286855246168983},{"$f":"IF($I$89=\"<25\",\"\",C89-C88)","v":31.896516489461199},{"$f":"IF($I$89=\"<25\",\"\",D89-D88)","v":27.737626466343599},{"$f":"IF($I$89=\"<25\",\"\",E89-E88)","v":23.682560589963288},17.002580384256344,14.52418234064816,9.0401496455248793]
["Rückgabe ABL",{"$f":"IF($I$90=\"<25\",\"\",B90-B88)","v":{"$error":"#VALUE!"}},{"$f":"IF($I$90=\"<25\",\"\",C90-C88)","v":{"$error":"#VALUE!"}},{"$error":"#VALUE!"},{"$error":"#VALUE!"},{"$error":"#VALUE!"},{"$error":"#VALUE!"},{"$error":"#VALUE!"}]
[]
[null,"Oktav-Relativspektrum fOkt [Hz] ABLUFT",null,null,null,null,null,null,"SLWA "]
[null,125,250,500,1000,2000,4000,8000,"Summe"]
[{"$f":"A57","v":"DAL 359300"},-11.692288650875099,-7.5570388237357431,-9.2734663123307151,-6.2480760413347562,-7.0508347807174996,-12.130270913937309,-14.238971613965139,{"$f":"10*LOG(10^(0.1*B96)+10^(0.1*C96)+10^(0.1*D96)+10^(0.1*E96)+10^(0.1*F96)+10^(0.1*G96)+10^(0.1*H96))","v":-0.48272457875338692}]
["DAL 359400",-11.159609322081582,-7.1779320929390664,-7.6015750860123203,-6.0637418436987645,-9.5871382342400118,-14.701819724059153,-16.095212266798431,{"$f":"10*LOG(10^(0.1*B97)+10^(0.1*C97)+10^(0.1*D97)+10^(0.1*E97)+10^(0.1*F97)+10^(0.1*G97)+10^(0.1*H97))","v":-0.66640976566315002}]
["DAL 359500",-10.50509419415938,-8.4111187812728883,-7.1176779773706098,-5.8890075103296091,-9.214357982505005,-15.164071375736919,-17.097800896212419,-0.68101586112741286]
["DAL 359600",-8.0610642424339058,-8.8859760821361302,-7.6235773027710865,-8.2725159366598913,-11.277547356036862,-14.377085181609271,-13.752123774014251,-1.1897426726361584]
["DAL 359800",-8.0610642424339058,-8.8859760821361302,-7.6235773027710865,-8.2725159366598913,-11.277547356036862,-14.377085181609271,-13.752123774014251,-1.1897426726361584,null,"Relativspektrum vom DAL 359DN 800 übernommen vom DN 600!"]
["DAL 358300",-10.876959162871021,-5.8099792964815453,-8.610648973295211,-10.263742501272922,-11.882672719460363,-11.997618641397164,-11.926664858547579,{"$f":"10*LOG(10^(0.1*B101)+10^(0.1*C101)+10^(0.1*D101)+10^(0.1*E101)+10^(0.1*F101)+10^(0.1*G101)+10^(0.1*H101))","v":-1.1459872775860163}]
["DAL 358400",-9.335055085299496,-5.747804685198699,-7.4437524705089455,-8.5216048631186876,-11.695014019062604,-13.081597308222239,-14.873667610156513,{"$f":"10*LOG(10^(0.1*B102)+10^(0.1*C102)+10^(0.1*D102)+10^(0.1*E102)+10^(0.1*F102)+10^(0.1*G102)+10^(0.1*H102))","v":-0.69112524371205786}]
["DAL 358500",-10.421693489358001,-6.5984613837740493,-6.9717899734723492,-8.7359640089274251,-11.757279319600404,-13.398058324404337,-15.180670226493865,{"$f":"10*LOG(10^(0.1*B103)+10^(0.1*C103)+10^(0.1*D103)+10^(0.1*E103)+10^(0.1*F103)+10^(0.1*G103)+10^(0.1*H103))","v":-1.0402713785341688}]
["DAL 358600",-7.5294770335353149,-6.9707139217032958,-7.4620519822521389,-8.7549169893046344,-11.158502868250821,-13.562686648158024,-16.086877470013164,{"$f":"10*LOG(10^(0.1*B104)+10^(0.1*C104)+10^(0.1*D104)+10^(0.1*E104)+10^(0.1*F104)+10^(0.1*G104)+10^(0.1*H104))","v":-0.78143578779508283}]
["DAL 358800",-7.5294770335353149,-6.9707139217032958,-7.4620519822521389,-8.7549169893046344,-11.158502868250821,-13.562686648158024,-16.086877470013164,-0.78143578779508283,null,"Relativspektrum vom DAL 358DN 800 übernommen vom DN 600!"]
["DRS100",-18.694808503399479,-13.440561955785506,-7.9585656477627182,-6.7940057004982837,-7.9746835586575999,-15.326173463485777,-18.534355649988299,-2.0012123621304525]
["DRS125",-15.223867429922688,-11.226819296644081,-9.001729912913806,-5.7411707608636116,-11.618078887054358,-17.518639852851187,-16.623110424863825,-2.1735184108677705]
["DRS180",-14.535143010384036,-10.090690845984728,-6.9979390654858333,-6.7244354996395312,-13.058819722813023,-15.301793439717496,-13.722036383286641,-1.7604813372202577]
["DRS250",-13.644202286707136,-10.395468147627847,-6.4708454740946291,-3.6723943905969447,-13.40516888486427,-19.301727929405963,-18.604637323296849,-0.6531300804483896]
["DRS315",-6.8833283016090778,-10.134224334007847,-7.8713941122882378,-9.3919122854247252,-12.671434972938854,-12.253219238824963,-9.4141196795766326,-0.92470292515800212]
["DRS355",-7.3156636753156334,-9.4797140637336774,-8.2955419037607356,-7.9138179225767118,-12.862234070264941,-14.162669306546963,-11.424298300388244,-1.1344459414003492]
["DIA100",null,null,null,null,null,null,null,8.4509804001425675]
["DIA125",null,null,null,null,null,null,null,8.4509804001425675]
["DIA180",null,null,null,null,null,null,null,8.4509804001425675]
[{"$f":"A76","v":"DIA250"},null,null,null,null,null,null,null,{"$f":"10*LOG(10^(0.1*B115)+10^(0.1*C115)+10^(0.1*D115)+10^(0.1*E115)+10^(0.1*F115)+10^(0.1*G115)+10^(0.1*H115))","v":8.4509804001425675}]
["DIA315",null,null,null,null,null,null,null,8.4509804001425675]
["DIA355",null,null,null,null,null,null,null,8.4509804001425675]
["MSA300",-12.859540974560719,-9.0006499384348615,-7.3609481684798679,-4.9216317733547843,-10.546851551928436,-14.808434588635091,-16.740346221392208,-0.83209776752434061]
["MSA400",-10.274577529392378,-7.8150989253556657,-7.9519461821382098,-7.3804214310206984,-12.981583122141831,-14.493858652531713,-13.344995417118332,{"$f":"10*LOG(10^(0.1*B119)+10^(0.1*C119)+10^(0.1*D119)+10^(0.1*E119)+10^(0.1*F119)+10^(0.1*G119)+10^(0.1*H119))","v":-1.3403438669924457}]
["MSA500",-8.8082167554670683,-7.33100056052462,-6.840568193825689,-9.3758952690583506,-14.037187754270136,-14.00616388449364,-10.861455568705981,-0.96836510064029446]
["MSA600",-7.608994460186068,-10.459342384040479,-8.0689308049248929,-10.167620797382863,-14.410717444218585,-13.460656899407439,-10.100893714019525,-1.5827254770529986]
[]
[]
["T[s] nach VDI 2081",null,null,null,"Nachhallzeit","Richtungsfaktor","Raumvolumen","äqu. Absorptionsfläche"]
["Raumart",null,"s",null,"t","Q","V","A"]
["Einzelbüro",null,0.5,null,"s",null,"m³","m²Sabine"]
["Großraumbüro",null,0.5,{"$f":"Auslegung!D45","v":"Großraumbüro"},{"$f":"VLOOKUP(D127,Lw!$A$126:$C$149,3,FALSE)","v":0.5},4,{"$f":"Auslegung!D37*Auslegung!D39*Auslegung!D40","v":126.392},{"$f":"0.163*G127/E127","v":41.203792}]
["Werkstätten",null,1.5]
["Ruheraum, Pausenraum",null,1]
["Untersuchungsraum Krankenhaus",null,2]
["Rundfunk-, Fernsehstudio",null,0.5]
["Chemielabor",null,2]
["Wasch- und WC-Raum, Umkleide",null,2]
["Schwimmbad",null,2]
["EDV-Raum",null,1.5]
["Konzertsaal",null,1.5]
["Lesesaal",null,1]
["Museum",null,1.5]
["Küche",null,1.5]
["Theater, Kino",null,1]
["Klassen- Seminarraum",null,1]
["Gaststätte",null,1]
["kein Typ",null,"x"]
["Konferenzraum",null,1]
["Hotelzimmer",null,0.5]
["Hörsaal",null,1]
["Bettenzimmer Krankenhaus",null,1]
["Verkaufsraum",null,1]
["Sporthalle",null,2]

{"sheet":"DR","index":9,"n_rows":32,"n_cols":4,"rows_kept":32,"cut":false,"hidden":true,"merged":[[0,0,0,10]]}
["Berechnung des Zugluftrisikos"]
["Achtung: Automatisierte Konstantenauswahl aus den \"-CAP\" Arbeitsblättern"]
["Annahme:","Turbulenzgrad =",40,"%"]
[]
["Konstanten Temperaturverhältnis",null,"K051",{"$f":"SUM('DAL359-CAP'!$C$51,'DAL358-CAP'!$C$51,'DRS-CAP'!$C$51,'DIA-CAP'!$C$51,'MSA-CAP'!$C$51)","v":0.22}]
[null,null,"K052",{"$f":"SUM('DAL359-CAP'!$C$52,'DAL358-CAP'!$C$52,'DRS-CAP'!$C$52,'DIA-CAP'!$C$52,'MSA-CAP'!$C$52)","v":1}]
["Temperaturen","Zuluft",{"$f":"Auslegung!$D$34","v":16}]
[null,"Raum",{"$f":"Auslegung!$D$35","v":26}]
[]
["1. Zugluftrisiko im Fußbodenbereich"]
[null,"Lauflänge",{"$f":"xkr._vx!$L$24","v":4.46}]
[null,"Luftgeschwindigkeit, errechnet",{"$f":"xkr._vx!$N$24","v":9.5781390134529146E-2}]
[null,"Luftgeschwindigkeit, gesetzt",{"$f":"IF(C12<0.05,0.05,C12)","v":9.5781390134529146E-2}]
[null,"lok. Temperaturdifferenz",{"$f":"($C$8-$C$7)*$D$5*(1/C11)^$D$6","v":0.4932735426008969}]
[null,"Absolute Temperatur",{"$f":"C8-C14","v":25.506726457399104}]
[null,"Zugluftrisiko",{"$f":"IF((34-C15)*((C13-0.05)^0.62)*(0.37*C13*$C$3+3.14)>100,100,IF((34-C15)*((C13-0.05)^0.62)*(0.37*C13*$C$3+3.14)<0,0,(34-C15)*((C13-0.05)^0.62)*(0.37*C13*$C$3+3.14)))","v":5.7205147172344128}]
[]
["2. Zugluftrisiko nach Stoßpunkt"]
[null,"Lauflänge",{"$f":"xkr._vx!$L$26","v":3.2199999999999998}]
[null,"Luftgeschwindigkeit, errechnet",{"$f":"xkr._vx!$N$26","v":0.12923851878743875}]
[null,"Luftgeschwindigkeit, gesetzt",{"$f":"IF(C20<0.05,0.05,C20)","v":0.12923851878743875}]
[null,"lok. Temperaturdifferenz",{"$f":"($C$8-$C$7)*$D$5*(1/C19)^$D$6","v":0.68322981366459634}]
[null,"Absolute Temperatur",{"$f":"C8-C22","v":25.316770186335404}]
[null,"Zugluftrisiko",{"$f":"IF((34-C23)*((C21-0.05)^0.62)*(0.37*C21*$C$3+3.14)>100,100,IF((34-C23)*((C21-0.05)^0.62)*(0.37*C21*$C$3+3.14)<0,0,(34-C23)*((C21-0.05)^0.62)*(0.37*C21*$C$3+3.14)))","v":9.1106199404103236},{"$f":"IF(C24<C32,C32,C24)","v":11.689995969441734}]
[]
["3. Zugluftrisiko nach Ablösen an X_kritisch"]
[null,"Lauflänge",{"$f":"xkr._vx!$L$28","v":2.7776117836352796}]
[null,"Luftgeschwindigkeit, errechnet",{"$f":"xkr._vx!N28","v":0.15379579051213171}]
[null,"Luftgeschwindigkeit, gesetzt",{"$f":"IF(C28<0.05,0.05,C28)","v":0.15379579051213171}]
[null,"lok. Temperaturdifferenz",{"$f":"($C$8-$C$7)*$D$5*(1/C27)^$D$6","v":0.79204733107831449}]
[null,"Absolute Temperatur",{"$f":"C8-C30","v":25.207952668921685}]
[null,"Zugluftrisiko",{"$f":"IF((34-C31)*((C29-0.05)^0.62)*(0.37*C29*$C$3+3.14)>100,100,IF((34-C31)*((C29-0.05)^0.62)*(0.37*C29*$C$3+3.14)<0,0,(34-C31)*((C29-0.05)^0.62)*(0.37*C29*$C$3+3.14)))","v":11.689995969441734}]

{"sheet":"xkr._vx","index":10,"n_rows":66,"n_cols":15,"rows_kept":66,"cut":false,"hidden":true,"merged":[]}
["Geschwindigkeit im Strahl und kritischer Strahlweg",null,null,null,null,null,"Annahme:","Winkel nach xkrit",45]
["Achtung: Automatisierte Konstantenauswahl aus den \"-CAP\" Arbeitsblättern"]
["Konstanten","K031",{"$f":"SUM('DAL359-CAP'!C44,'DAL358-CAP'!C44,'DRS-CAP'!C44,'DIA-CAP'!C44,'MSA-CAP'!C44)","v":7.7669999999999996E-4},null,"Konstanten:","K041",{"$f":"SUM('DAL359-CAP'!C48,'DAL358-CAP'!C48,'DRS-CAP'!C48,'DIA-CAP'!C48,'MSA-CAP'!C48)","v":6.0010000000000003E-3},null,"Konstanten","K071",{"$f":"SUM('DAL358-CAP'!C53,'MSA-CAP'!C53)","v":1.0582894736842104E-3}]
[null,"K032",{"$f":"SUM('DAL359-CAP'!C45,'DAL358-CAP'!C45,'DRS-CAP'!C45,'DIA-CAP'!C45,'MSA-CAP'!C45)","v":1.07},null,null,"K042",{"$f":"SUM('DAL359-CAP'!C49,'DAL358-CAP'!C49,'DRS-CAP'!C49,'DIA-CAP'!C49,'MSA-CAP'!C49)","v":0.49180000000000001},null,null,"K072",{"$f":"SUM('DAL358-CAP'!C54,'MSA-CAP'!C54)","v":0.5}]
[null,"K033",{"$f":"SUM('DAL359-CAP'!C46,'DAL358-CAP'!C46,'DRS-CAP'!C46,'DIA-CAP'!C46,'MSA-CAP'!C46)","v":1},null,null,"K043",{"$f":"SUM('DAL359-CAP'!C50,'DAL358-CAP'!C50,'DRS-CAP'!C50,'DIA-CAP'!C50,'MSA-CAP'!C50)","v":0.99829999999999997},null,null,"K081",{"$f":"SUM('DAL358-CAP'!C55,'MSA-CAP'!C55)","v":2.6802631578947368E-3}]
[null,"K034",{"$f":"SUM('DAL359-CAP'!C47,'DAL358-CAP'!C47,'DRS-CAP'!C47,'DIA-CAP'!C47,'MSA-CAP'!C47)","v":0.70699999999999996},null,null,"Dt0",{"$f":"IF(Auslegung!$D$35-Auslegung!$D$34>0,Auslegung!$D$35-Auslegung!$D$34,ABS(Auslegung!$D$35-Auslegung!$D$34))","v":10},null,null,"K082",{"$f":"SUM('DAL358-CAP'!C56,'MSA-CAP'!C56)","v":0.64300000000000002}]
[null,null,null,null,null,null,null,null,null,"K083",{"$f":"SUM('DAL358-CAP'!C57,'MSA-CAP'!C57)","v":1.2869999999999999}]
[null,"Lauflänge","Geschwindigkeit im Strahl horizontal","Geschwindigkeit im Strahl vertikal",null,"kritischer Strahlweg Anzeige","kritischer Strahlweg","vertikaler Strahlweg",null,"Geschwindigkeit im Strahl an xKr"]
[null,"L","v0","v1",null,"xkr._Anzeige","xkr.","y",null,"v0"]
[null,"m","m/s","m/s",null,"m","m","m",null,"m/s"]
[null,0.5,{"$f":"$C$3*Auslegung!$D$32*(1/xkr._vx!B11)^xkr._vx!$C$5","v":0.85436999999999996},{"$f":"1/B11*$J$11","v":0.81192944320825688},null,{"$f":"IF($J$27<Auslegung!$D$39,$J$27,\">Raumlänge\")","v":1.0522712375401038},{"$f":"IF(J27<Auslegung!D39,xkr._vx!J27,Auslegung!D39)","v":1.0522712375401038},{"$f":"(Auslegung!$D$37-Auslegung!$D$38)/SIN(45/180*PI())","v":1.7253405460951758},null,{"$f":"$C$3*Auslegung!$D$32*(1/xkr._vx!G11)^(xkr._vx!$C$5)","v":0.40596472160412844}]
[null,0.6,{"$f":"$C$3*Auslegung!$D$32*(1/xkr._vx!B12)^xkr._vx!$C$5","v":0.71197500000000002},{"$f":"1/B12*$J$11","v":0.67660786934021411}]
[null,0.7,{"$f":"$C$3*Auslegung!$D$32*(1/xkr._vx!B13)^xkr._vx!$C$5","v":0.6102642857142857},0.57994960229161208]
[null,0.8,{"$f":"$C$3*Auslegung!$D$32*(1/xkr._vx!B14)^xkr._vx!$C$5","v":0.53398124999999996},0.50745590200516055]
[null,0.9,{"$f":"$C$3*Auslegung!$D$32*(1/xkr._vx!B15)^xkr._vx!$C$5","v":0.47465000000000002},{"$f":"1/B15*$J$11","v":0.45107191289347609}]
[null,1,{"$f":"$C$3*Auslegung!$D$32*(1/xkr._vx!B16)^xkr._vx!$C$5","v":0.42718499999999998},0.40596472160412844]
[null,1.1000000000000001,{"$f":"$C$3*Auslegung!$D$32*(1/xkr._vx!B17)^xkr._vx!$C$5","v":0.38834999999999997},0.36905883782193494]
[null,1.2,{"$f":"$C$3*Auslegung!$D$32*(1/xkr._vx!B18)^xkr._vx!$C$5","v":0.35598750000000001},0.33830393467010705]
[null,1.3,{"$f":"$C$3*Auslegung!$D$32*(1/xkr._vx!B19)^xkr._vx!$C$5","v":0.32860384615384614},0.31228055508009878]
[null,1.4,{"$f":"$C$3*Auslegung!$D$32*(1/xkr._vx!B20)^xkr._vx!$C$5","v":0.30513214285714285},{"$f":"1/B20*$J$11","v":0.28997480114580604}]
[null,1.5,{"$f":"$C$3*Auslegung!$D$32*(1/xkr._vx!B21)^xkr._vx!$C$5","v":0.28478999999999999},0.27064314773608561]
[null,1.6,{"$f":"$C$3*Auslegung!$D$32*(1/xkr._vx!B22)^xkr._vx!$C$5","v":0.26699062499999998},0.25372795100258028,null,null,null,null," 1/2 Durchlassabstand","hor. Lauflänge","ver. Lauflänge","ges. Lauflänge","Geschw. Endpunkt","Geschw. OK A-Ber."]
[null,1.7,{"$f":"$C$3*Auslegung!$D$32*(1/xkr._vx!B23)^xkr._vx!$C$5","v":0.25128529411764705},0.2388027774141932,"Betrachtung Strahlweg frei entlang der Decke bis Wandkante",null,null,null,null,{"$f":"Auslegung!$D$41","v":0.91},null,null,{"$f":"$C$3*Auslegung!$D$32*(1/xkr._vx!J23)^xkr._vx!$C$5","v":0.46943406593406584}]
[null,1.8,{"$f":"$C$3*Auslegung!$D$32*(1/xkr._vx!B24)^xkr._vx!$C$5","v":0.23732500000000001},0.22553595644673805,"Betrachtung Strahlweg von Wandkante bis Fußboden Aufenthaltsbereich",null,null,null,null,null,{"$f":"Auslegung!$D$37+0.5","v":3.55},{"$f":"K24+J23","v":4.46},null,{"$f":"$C$3*Auslegung!$D$32*(1/xkr._vx!L24)^xkr._vx!$C$5","v":9.5781390134529146E-2}]
[null,1.9,{"$f":"$C$3*Auslegung!$D$32*(1/xkr._vx!B25)^xkr._vx!$C$5","v":0.22483421052631578},0.21366564294954127,"Betrachtung Strahlweg von Durchlassmitte bis Stoßpunkt",null,null,null,{"$f":"Auslegung!$D$42","v":2},null,null,null,{"$f":"$C$3*Auslegung!$D$32*(1/xkr._vx!I25)^xkr._vx!$C$5","v":0.21359249999999999}]
[null,2,{"$f":"$C$3*Auslegung!$D$32*(1/xkr._vx!B26)^xkr._vx!$C$5","v":0.21359249999999999},0.20298236080206422,"Betrachtung Freistrahl ab Stoßpunkt bis Oberkante Aufenthaltsbereich",null,null,null,null,null,{"$f":"Auslegung!$D$37-Auslegung!$D$38","v":1.2199999999999998},{"$f":"K26+I25","v":3.2199999999999998},null,{"$f":"$C$3*Auslegung!$D$32*(1/((xkr._vx!I25)+xkr._vx!$C$4*xkr._vx!K26))^xkr._vx!$C$5","v":0.12923851878743875},{"$f":"IF(N26<N28,N28,N26)","v":0.15379579051213171}]
[null,2.1,{"$f":"$C$3*Auslegung!$D$32*(1/xkr._vx!B27)^xkr._vx!$C$5","v":0.20342142857142856},0.19331653409720401,"Betrachtung Strahlweg bis xkritisch",null,null,null,null,{"$f":"$G$3*Auslegung!$D$32^$G$5*(1/xkr._vx!$G$6^(xkr._vx!$G$4))","v":1.0522712375401038},null,null,{"$f":"$C$3*Auslegung!$D$32*(1/xkr._vx!J27)^xkr._vx!$C$5","v":0.40596472160412844}]
[null,2.2000000000000002,{"$f":"$C$3*Auslegung!$D$32*(1/xkr._vx!B28)^xkr._vx!$C$5","v":0.19417499999999999},0.18452941891096747,"Betrachtung von xkritisch bis Oberkante Aufenthaltsbereich",null,null,null,null,null,{"$f":"(Auslegung!$D$37-Auslegung!$D$38)/SIN($I$1/180*PI())","v":1.7253405460951758},{"$f":"J27+K28","v":2.7776117836352796},null,{"$f":"$C$3*Auslegung!$D$32*(1/xkr._vx!L28)^xkr._vx!$C$5","v":0.15379579051213171}]
[null,2.2999999999999998,{"$f":"$C$3*Auslegung!$D$32*(1/xkr._vx!B29)^xkr._vx!$C$5","v":0.1857326086956522},0.17650640069744716]
[null,2.4,{"$f":"$C$3*Auslegung!$D$32*(1/xkr._vx!B30)^xkr._vx!$C$5","v":0.17799375000000001},0.16915196733505353,"Betrachtung Heizfall (Für MSA), Walzenstellung CD"]
[null,2.5,{"$f":"$C$3*Auslegung!$D$32*(1/xkr._vx!B31)^xkr._vx!$C$5","v":0.170874},0.16238588864165138,null,null,null,null,null,null,{"$f":"Auslegung!$D$37-Auslegung!$D$38","v":1.2199999999999998},{"$f":"K31+I30","v":1.2199999999999998},{"$f":"$K$5*(Auslegung!$D$32^xkr._vx!$K$7)/(xkr._vx!G6^xkr._vx!K6)","v":2.051276563499465},{"$f":"$C$3*Auslegung!$D$32*(1/((xkr._vx!I30+xkr._vx!K31)+xkr._vx!$C$4*xkr._vx!K31))^xkr._vx!$C$5","v":0.1691553813257306}]
[null,2.6,{"$f":"$C$3*Auslegung!$D$32*(1/xkr._vx!B32)^xkr._vx!$C$5","v":0.16430192307692307},0.15614027754004939]
[null,2.7,{"$f":"$C$3*Auslegung!$D$32*(1/xkr._vx!B33)^xkr._vx!$C$5","v":0.15821666666666664},0.15035730429782534]
[null,2.8,{"$f":"$C$3*Auslegung!$D$32*(1/xkr._vx!B34)^xkr._vx!$C$5","v":0.15256607142857143},0.14498740057290302]
[null,2.9,{"$f":"$C$3*Auslegung!$D$32*(1/xkr._vx!B35)^xkr._vx!$C$5","v":0.1473051724137931},0.13998783503590637]
[null,3,{"$f":"$C$3*Auslegung!$D$32*(1/xkr._vx!B36)^xkr._vx!$C$5","v":0.14239499999999999},0.1353215738680428,null,null,null,null,null,"Maximalgeschw.","ges. Lauflänge bis vmax","Lauflänge vertikal","Wandabstand"]
[null,3.1,{"$f":"$C$3*Auslegung!$D$32*(1/xkr._vx!B37)^xkr._vx!$C$5","v":0.13780161290322579},0.13095636180778336]
[null,3.2,{"$f":"$C$3*Auslegung!$D$32*(1/xkr._vx!B38)^xkr._vx!$C$5","v":0.13349531249999999},0.12686397550129014,null,"Berechnung Wandabstand bei vorgegebener Max. Geschw.",null,null,null,{"$f":"Auslegung!$D$33","v":0.2},{"$f":"1/(J38/($C$3*Auslegung!$D$32))^(1/xkr._vx!$C$5)","v":2.1359249999999999},{"$f":"Auslegung!$D$37-Auslegung!$D$38","v":1.2199999999999998},{"$f":"K38-L38","v":0.9159250000000001}]
[null,3.3,{"$f":"$C$3*Auslegung!$D$32*(1/xkr._vx!B39)^xkr._vx!$C$5","v":0.12945000000000001},0.12301961260731165]
[null,3.4,{"$f":"$C$3*Auslegung!$D$32*(1/xkr._vx!B40)^xkr._vx!$C$5","v":0.12564264705882353},0.1194013887070966]
[null,3.5,{"$f":"$C$3*Auslegung!$D$32*(1/xkr._vx!B41)^xkr._vx!$C$5","v":0.12205285714285713},0.1159899204583224]
[null,3.6,{"$f":"$C$3*Auslegung!$D$32*(1/xkr._vx!B42)^xkr._vx!$C$5","v":0.1186625},0.11276797822336902]
[null,3.7,{"$f":"$C$3*Auslegung!$D$32*(1/xkr._vx!B43)^xkr._vx!$C$5","v":0.11545540540540539},0.1097201950281428]
[null,3.8,{"$f":"$C$3*Auslegung!$D$32*(1/xkr._vx!B44)^xkr._vx!$C$5","v":0.11241710526315789},0.10683282147477063]
[null,3.9,{"$f":"$C$3*Auslegung!$D$32*(1/xkr._vx!B45)^xkr._vx!$C$5","v":0.1095346153846154},0.10409351836003294]
[null,4,{"$f":"$C$3*Auslegung!$D$32*(1/xkr._vx!B46)^xkr._vx!$C$5","v":0.10679625},0.10149118040103211]
[null,4.0999999999999996,{"$f":"$C$3*Auslegung!$D$32*(1/xkr._vx!B47)^xkr._vx!$C$5","v":0.10419146341463414},9.9015785757104513E-2]
[null,4.2,{"$f":"$C$3*Auslegung!$D$32*(1/xkr._vx!B48)^xkr._vx!$C$5","v":0.10171071428571428},9.6658267048602003E-2]
[null,4.3,{"$f":"$C$3*Auslegung!$D$32*(1/xkr._vx!B49)^xkr._vx!$C$5","v":9.9345348837209302E-2},9.4410400373053122E-2]
[null,4.4000000000000004,{"$f":"$C$3*Auslegung!$D$32*(1/xkr._vx!B50)^xkr._vx!$C$5","v":9.7087499999999993E-2},9.2264709455483734E-2]
[null,4.5,{"$f":"$C$3*Auslegung!$D$32*(1/xkr._vx!B51)^xkr._vx!$C$5","v":9.4929999999999987E-2},9.0214382578695199E-2]
[null,4.5999999999999996,{"$f":"$C$3*Auslegung!$D$32*(1/xkr._vx!B52)^xkr._vx!$C$5","v":9.2866304347826098E-2},8.8253200348723582E-2]
[null,4.7,{"$f":"$C$3*Auslegung!$D$32*(1/xkr._vx!B53)^xkr._vx!$C$5","v":9.0890425531914884E-2},8.6375472681729459E-2]
[null,4.8,{"$f":"$C$3*Auslegung!$D$32*(1/xkr._vx!B54)^xkr._vx!$C$5","v":8.8996875000000003E-2},8.4575983667526763E-2]
[null,4.9000000000000004,{"$f":"$C$3*Auslegung!$D$32*(1/xkr._vx!B55)^xkr._vx!$C$5","v":8.718061224489794E-2},8.2849943184515995E-2]
[null,5,{"$f":"$C$3*Auslegung!$D$32*(1/xkr._vx!B56)^xkr._vx!$C$5","v":8.5436999999999999E-2},8.1192944320825688E-2]
[null,5.0999999999999996,{"$f":"$C$3*Auslegung!$D$32*(1/xkr._vx!B57)^xkr._vx!$C$5","v":8.3761764705882355E-2},7.9600925804731076E-2]
[null,5.2,{"$f":"$C$3*Auslegung!$D$32*(1/xkr._vx!B58)^xkr._vx!$C$5","v":8.2150961538461534E-2},7.8070138770024694E-2]
[null,5.3,{"$f":"$C$3*Auslegung!$D$32*(1/xkr._vx!B59)^xkr._vx!$C$5","v":8.0600943396226421E-2},7.6597117283797825E-2]
[null,5.4,{"$f":"$C$3*Auslegung!$D$32*(1/xkr._vx!B60)^xkr._vx!$C$5","v":7.9108333333333322E-2},7.5178652148912672E-2]
[null,5.5,{"$f":"$C$3*Auslegung!$D$32*(1/xkr._vx!B61)^xkr._vx!$C$5","v":7.7670000000000003E-2},7.3811767564386996E-2]
[null,5.6,{"$f":"$C$3*Auslegung!$D$32*(1/xkr._vx!B62)^xkr._vx!$C$5","v":7.6283035714285713E-2},7.249370028645151E-2]
[null,5.7,{"$f":"$C$3*Auslegung!$D$32*(1/xkr._vx!B63)^xkr._vx!$C$5","v":7.4944736842105258E-2},7.1221880983180427E-2]
[null,5.8,{"$f":"$C$3*Auslegung!$D$32*(1/xkr._vx!B64)^xkr._vx!$C$5","v":7.3652586206896548E-2},6.9993917517953183E-2]
[null,5.8999999999999897,{"$f":"$C$3*Auslegung!$D$32*(1/xkr._vx!B65)^xkr._vx!$C$5","v":7.240423728813572E-2},6.8807579932903248E-2]
[null,6,{"$f":"$C$3*Auslegung!$D$32*(1/xkr._vx!B66)^xkr._vx!$C$5","v":7.1197499999999997E-2},6.7660786934021402E-2]

{"sheet":"Eingabe","index":11,"n_rows":50,"n_cols":20,"rows_kept":50,"cut":false,"hidden":true,"merged":[]}
[]
[null,null,null,null,1,"= Produktgruppe emcoair"]
[null,null,null,null,null,"KSW","Artikel"]
[null,null,null,null,null,null,1,"Schlitzanzahl","1 Schlitz "]
[null,null,null,null,null,null,2,null,"2 Schlitze"]
[null,null,null,null,null,null,"X",null,"Sonder"]
[null,null,null,null,null,null,null,"K","Funktion","Zuluft / Abluft Kombination"]
[null,null,null,null,null,null,null,"Z",null,"Zuluft"]
[null,null,null,null,null,null,null,"A",null,"Abluft"]
[null,null,null,null,null,null,null,null,"0500","Breite"]
[null,null,null,null,null,null,null,null,"0600"]
[null,null,null,null,null,null,null,null,"0700"]
[null,null,null,null,null,null,null,null,"0800"]
[null,null,null,null,null,null,null,null,"0900"]
[null,null,null,null,null,null,null,null,"1000"]
[null,null,null,null,null,null,null,null,"1100"]
[null,null,null,null,null,null,null,null,"1200"]
[null,null,null,null,null,null,null,null,null,"A","Werkstoff","Aluminium"]
[]
[]
[null,null,null,null,null,null,null,null,null,null,9010,"Oberfläche Luftdurchlass","RAL 9010 glänzend"]
[null,null,null,null,null,null,null,null,null,null,"E6C0",null,"Aluminium naturfarbig eloxiert"]
[null,null,null,null,null,null,null,null,null,null,"XXXX",null,"RAL-Ton **** glänzend"]
[null,null,null,null,null,null,null,null,null,null,"SSSS",null,"Sonderlackierung"]
[null,null,null,null,null,null,null,null,null,null,null,"S","Farbe Luftlenkelement","schwarz"]
[null,null,null,null,null,null,null,null,null,null,null,"W",null,"weiß"]
[null,null,null,null,null,null,null,null,null,null,null,"G",null,"grau"]
[null,null,null,null,null,null,null,null,null,null,null,null,"C","Luftlenkeinstellung","DE"]
[null,null,null,null,null,null,null,null,null,null,null,null,"S",null,"Sonder"]
[null,null,null,null,null,null,null,null,null,null,null,null,null,"V","Werkstoff Anschlusskasten","Stahl verzinkt"]
[null,null,null,null,null,null,null,null,null,null,null,null,null,0,null,"ohne Anschlusskasten"]
[null,null,null,null,null,null,null,null,null,null,null,null,null,null,1,"Drossel ","mit FBD"]
[null,null,null,null,null,null,null,null,null,null,null,null,null,null,0,null,"ohne FBD"]
[null,null,null,null,null,null,null,null,null,null,null,null,null,null,null,"B1","Innenauskleidung","Dämmung Baustoffklasse B1"]
[null,null,null,null,null,null,null,null,null,null,null,null,null,null,null,"A2",null,"Dämmung Baustoffklasse A2"]
[null,null,null,null,null,null,null,null,null,null,null,null,null,null,null,null,1,"Stutzenanzahl","1 Stutzen"]
[null,null,null,null,null,null,null,null,null,null,null,null,null,null,null,null,"x",null,"Sonder"]
[null,null,null,null,null,null,null,null,null,null,null,null,null,null,null,null,null,100,"Stutzendurchmesser","98 mm"]
[null,null,null,null,null,null,null,null,null,null,null,null,null,null,null,null,null,"080",null,"78 mm"]
[null,null,null,null,null,null,null,null,null,null,null,null,null,null,null,null,null,"xxx",null,"Sonder"]
[null,null,null,null,{"$f":"E2","v":1},{"$f":"F3","v":"KSW"},{"$f":"G4","v":1},1,{"$f":"I10","v":"0500"},{"$f":"J18","v":"A"},{"$f":"K21","v":9010},{"$f":"L25","v":"S"},{"$f":"M28","v":"C"},{"$f":"N30","v":"V"},{"$f":"O32","v":1},{"$f":"P34","v":"B1"},{"$f":"Q36","v":1},{"$f":"R38","v":100}]
[]
[]
[]
["Schwarz","S"]
["weiß","W"]
["naturfarbig eloxiert","K"]
["weiß (RAL 9010) bepulvert","L"]
["Anschlusskasten ohne Mengeneinstellung","AK1"]
["Anschlusskasten mit Mengeneinstellung*","AK2"]

{"sheet":"DAL359-CAP","index":12,"n_rows":69,"n_cols":12,"rows_kept":69,"cut":false,"hidden":true,"merged":[]}
["Übergabedaten:",null,"Gewählter Durchlass",null,{"$f":"CONCATENATE(Auslegung!$D$12,Auslegung!$D$25,\"d\")","v":"DAL 358800d"}]
[null,null,"Volumenstrom",null,{"$f":"Auslegung!$D$32","v":550}]
[null,null,"Temperaturdifferenz",null,{"$f":"Auslegung!$D$35-Auslegung!$D$34","v":10}]
[null,null,"DAL 359","DAL 359","DAL 359","DAL 359","DAL 359","DAL 359","DAL 359","DAL 359","DAL 359"]
[null,null,300,400,400,500,500,600,600,800,800]
[null,null,{"$f":"CONCATENATE(C4,C5,\"d\")","v":"DAL 359300d"},{"$f":"CONCATENATE(D4,D5,\"d\")","v":"DAL 359400d"},{"$f":"CONCATENATE(E4,E5,\"f\")","v":"DAL 359400f"},{"$f":"CONCATENATE(F4,F5,\"d\")","v":"DAL 359500d"},{"$f":"CONCATENATE(G4,G5,\"f\")","v":"DAL 359500f"},{"$f":"CONCATENATE(H4,H5,\"d\")","v":"DAL 359600d"},{"$f":"CONCATENATE(I4,I5,\"f\")","v":"DAL 359600f"},{"$f":"CONCATENATE(J4,J5,\"d\")","v":"DAL 359800d"},{"$f":"CONCATENATE(K4,K5,\"f\")","v":"DAL 359800f"},1]
[null,null,"Deckenbündig","Deckenbündig","freihängend","Deckenbündig","freihängend","Deckenbündig","freihängend","Deckenbündig","freihängend",2]
["Konstante","K011",1.3564396446483764E-3,2.6699999999999998E-4,2.63E-4,1.3359999999999999E-4,9.8499999999999995E-5,7.3540000000000004E-5,4.1600000000000002E-5,1.9530000000000001E-5,9.5000000000000005E-6,3]
[null,"K012",2.0215396196408024,1.9970000000000001,2,1.9550000000000001,2,1.9219999999999999,2,1.9079999999999999,2,4]
[null,"K021",-102.888569032159,-113.4,-113.83,-125.2,-127.15,-142.40600000000001,-119.65,-142.9,-142.41999999999999,5]
[null,"K022",65.234160765871067,58.16,58.34,58.87,59.54,63.15,53.87,56.58,56.47,6]
[null,"K031",3.2000000000000002E-3,2.905E-3,1.74E-3,2.346E-3,1.3699999999999999E-3,1.188E-3,8.9999999999999998E-4,7.6179999999999998E-4,4.1800000000000002E-4,7]
[null,"K032",1,1,1,1,1,1,1,1,1,8]
[null,"K033",1.087,1.087,1,1.087,1,1.087,1.1579999999999999,1.087,1,9]
[null,"K034",0.70699999999999996,0.70699999999999996,null,0.70699999999999996,null,0.70699999999999996,null,0.70699999999999996,null,10]
[null,"K041",2.41E-2,2.087E-2,null,1.7579999999999998E-2,null,8.9079999999999993E-3,null,6.0429999999999998E-3,null,11]
[null,"K042",0.5,0.5,null,0.5,null,0.5,null,0.5,null,12]
[null,"K043",1,1,null,1,null,1,null,1,null,13]
[null,"K051",null,0.16300000000000001,0.16300000000000001,0.21299999999999999,0.21299999999999999,0.32600000000000001,0.32600000000000001,0.48,0.48,14]
[null,"K052",null,1.2070000000000001,1.2070000000000001,1.2070000000000001,1.2070000000000001,1.2070000000000001,1.2070000000000001,1.2070000000000001,1.2070000000000001,15]
[null,"K071",null,0,null,0,null,0,null,0,null,16]
[null,"K072",null,0,null,0,null,0,null,0,null,17]
[null,"K081",null,0,null,0,null,0,null,0,null,18]
[null,"K082",null,0,null,0,null,0,null,0,null,19]
[null,"K083",null,0,null,0,null,0,null,0,null,20]
[null,"K091",null,0,null,0,null,0,null,0,null,21]
[null,"K092",null,1500,null,2040,null,3130,null,8960,null,22]
[null,"K093",null,3,null,3,null,3,null,3,null,23]
[null,"K094",null,0,null,0,null,0,null,0,null,24]
[null,"K101",null,-0.69299999999999995,null,-0.69299999999999995,null,-0.69299999999999995,null,-0.69299999999999995,null,25]
[null,"K102",null,33,null,33,null,33,null,33,null,26]
[null,"K103",null,0.06,null,7.4999999999999997E-2,null,9.5000000000000001E-2,null,0.12,null,27]
[null,"K104",null,0.01,null,0.01,null,0.01,null,0.01,null,28]
[null,"K021Abluft",-99.558258540692378,-107.29950575045943,-107.29950575045943,{"$f":"-126.937694154299-3","v":-129.93769415429898},{"$f":"-126.937694154299-3","v":-129.93769415429898},-81.652092447706806,-81.652092447706806,null,null,29]
[null,"K022Abluft",62.064710869111522,57.54374641123853,57.54374641123853,61.553727979774131,61.553727979774131,41.931738754937285,41.931738754937285,null,null,30]
[null,"K011Abluft",1.9881360943777688E-3,3.0857126905320978E-4,3.0857126905320978E-4,6.7898250177364115E-5,6.7898250177364115E-5,4.7214089794199927E-5,4.7214089794199927E-5,null,null,31]
[null,"K012Abluft",1.9519956311320683,1.9644185415338546,1.9644185415338546,2.0742491804922922,2.0742491804922922,2.0087968274452264,2.0087968274452264,null,null,32]
[null,null,{"$f":"IFERROR(HLOOKUP($E$1,$C$6:$K$33,L6,FALSE),\"\")","v":""}]
[null,null,{"$f":"IFERROR(HLOOKUP($E$1,$C$6:$K$33,L7,FALSE),\"\")","v":""}]
["Rückgabe","K011",""]
[null,"K012",""]
[null,"K021",""]
[null,"K022",""]
[null,"K031",""]
[null,"K032",""]
[null,"K033",""]
[null,"K034",""]
[null,"K041",""]
[null,"K042",""]
[null,"K043",""]
[null,"K051",""]
[null,"K052",""]
[null,"K071",""]
[null,"K072",""]
[null,"K081",""]
[null,"K082",""]
[null,"K083",""]
[null,"K091",""]
[null,"K092",""]
[null,"K093",""]
[null,"K094",""]
[null,"K101",""]
[null,"K102",""]
[null,"K103",""]
[null,"K104",""]
[null,"K021Abluft",{"$f":"IFERROR(HLOOKUP($E$1,$C$6:$K$35,L34,FALSE),\"\")","v":""}]
[null,"K022Abluft",{"$f":"IFERROR(HLOOKUP($E$1,$C$6:$K$35,L35,FALSE),\"\")","v":""}]
[null,"K011Abluft",{"$f":"IFERROR(HLOOKUP($E$1,$C$6:$K$37,L36,FALSE),\"\")","v":""}]
[null,"K012Abluft",{"$f":"IFERROR(HLOOKUP($E$1,$C$6:$K$37,L37,FALSE),\"\")","v":""}]

{"sheet":"DAL358-CAP","index":13,"n_rows":69,"n_cols":15,"rows_kept":69,"cut":false,"hidden":true,"merged":[[20,14,24,14]]}
["Übergabedaten:",null,"Gewählter Durchlass",null,{"$f":"CONCATENATE(Auslegung!$D$12,Auslegung!$D$25,\"d\")","v":"DAL 358800d"}]
[null,null,"Volumenstrom",null,{"$f":"Auslegung!$D$32","v":550}]
[null,null,"Temperaturdifferenz",null,{"$f":"Auslegung!$D$35-Auslegung!$D$34","v":10}]
[null,null,"DAL 358","DAL 358","DAL 358","DAL 358","DAL 358","DAL 358","DAL 358","DAL 358","DAL 358"]
[null,null,300,400,400,500,500,600,600,800,800]
[null,null,{"$f":"CONCATENATE(C4,C5,\"d\")","v":"DAL 358300d"},{"$f":"CONCATENATE(D4,D5,\"d\")","v":"DAL 358400d"},{"$f":"CONCATENATE(E4,E5,\"f\")","v":"DAL 358400f"},{"$f":"CONCATENATE(F4,F5,\"d\")","v":"DAL 358500d"},{"$f":"CONCATENATE(G4,G5,\"f\")","v":"DAL 358500f"},{"$f":"CONCATENATE(H4,H5,\"d\")","v":"DAL 358600d"},{"$f":"CONCATENATE(I4,I5,\"f\")","v":"DAL 358600f"},{"$f":"CONCATENATE(J4,J5,\"d\")","v":"DAL 358800d"},{"$f":"CONCATENATE(K4,K5,\"f\")","v":"DAL 358800f"},1]
[null,null,"Deckenbündig","Deckenbündig","freihängend","Deckenbündig","freihängend","Deckenbündig","freihängend","Deckenbündig","freihängend",2,null,"A1/F6"]
["Konstante","K011",1.5113277034360106E-3,2.8600000000000001E-3,2.8600000000000001E-3,1.75E-3,1.75E-3,3.0299999999999999E-4,3.0299999999999999E-4,3.01E-4,3.01E-4,3,null,2.5200000000000001E-3]
[null,"K012",1.9941675832634518,1.67,1.67,1.62,1.62,1.77,1.77,1.68,1.68,4,null,1.92]
[null,"K021",-65.683763355297202,-97.77,-97.77,-124.54,-124.54,-136.30000000000001,-136.30000000000001,-141.4,-141.4,5,null,-75.599999999999994]
[null,"K022",48.466188743658236,56.79,56.79,62.47,62.47,63.1,63.1,62.47,62.47,6,null,53.72]
[null,"K031",1.5E-3,1.3110000000000001E-3,1.0300000000000001E-3,1.0809999999999999E-3,8.7500000000000002E-4,9.0910000000000003E-4,7.0699999999999995E-4,7.7669999999999996E-4,6.2200000000000005E-4,7,null,5.0270000000000002E-3]
[null,"K032",1.07,1.07,1,1.07,1,1.07,1,1.07,1,8,null,5.8]
[null,"K033",1,1,1.07,1,1.07,1,1.07,1,1.07,9,null,0.5]
[null,"K034",0.70699999999999996,0.70699999999999996,null,0.70699999999999996,null,0.70699999999999996,null,0.70699999999999996,null,10,null,0.70699999999999996]
[null,"K041",1.78E-2,1.762E-2,null,1.166E-2,null,1.1639999999999999E-2,null,6.0010000000000003E-3,null,11,null,8.8200000000000001E-2]
[null,"K042",0.49680000000000002,0.49680000000000002,null,0.51439999999999997,null,0.52110000000000001,null,0.49180000000000001,null,12,null,0.64300000000000002]
[null,"K043",1.014,1.014,null,1.008,null,0.96260000000000001,null,0.99829999999999997,null,13,null,1.2869999999999999]
[null,"K051",null,0.10199999999999999,0.10199999999999999,0.13200000000000001,0.13200000000000001,0.18,0.18,0.22,0.22,14,null,4.9660000000000003E-2]
[null,"K052",null,1,1,1,1,1,1,1,1,15,null,0.5]
[null,"K071",8.0429999999999998E-3,{"$f":"N21*(1/2)","v":4.0214999999999999E-3},null,{"$f":"N21*(1/3.2)","v":2.5134375E-3},null,{"$f":"N21*(1/5.2)","v":1.546730769230769E-3},null,{"$f":"N21*(1/7.6)","v":1.0582894736842104E-3},null,16,null,8.0429999999999998E-3,"Heizfallkonstanten SAL 35 aus CAP"]
[null,"K072",0.5,0.5,null,0.5,null,0.5,null,0.5,null,17,null,0.5]
[null,"K081",2.0369999999999999E-2,{"$f":"N23*(1/2)","v":1.0185E-2},null,{"$f":"N23*(1/3.2)","v":6.3656249999999998E-3},null,{"$f":"N23*(1/5.2)","v":3.9173076923076922E-3},null,{"$f":"N23*(1/7.6)","v":2.6802631578947368E-3},null,18,null,2.0369999999999999E-2]
[null,"K082",0.64300000000000002,0.64300000000000002,null,0.64300000000000002,null,0.64300000000000002,null,0.64300000000000002,null,19,null,0.64300000000000002]
[null,"K083",1.2869999999999999,1.2869999999999999,null,1.2869999999999999,null,1.2869999999999999,null,1.2869999999999999,null,20,null,1.2869999999999999]
[null,"K091",null,0,null,0,null,0,null,0,null,21,null,0]
[null,"K092",null,1500,null,2040,null,3130,null,8960,null,22,null,47]
[null,"K093",null,3,null,3,null,3,null,3,null,23,null,2.5]
[null,"K094",null,0,null,0,null,0,null,0,null,24,null,0]
[null,"K101",null,-0.69299999999999995,null,-0.69299999999999995,null,-0.69299999999999995,null,-0.69299999999999995,null,25,null,-0.69299999999999995]
[null,"K102",null,33,null,33,null,33,null,33,null,26,null,24]
[null,"K103",null,0.06,null,7.4999999999999997E-2,null,9.5000000000000001E-2,null,0.12,null,27,null,7.0000000000000001E-3]
[null,"K104",null,0.01,null,0.01,null,0.01,null,0.01,null,28,null,0.01]
[null,"K021Abluft",-40.118064606526026,-83.599570336952624,-83.599570336952624,-90.013746180002244,-90.013746180002244,-88.48537160615038,-88.48537160615038,null,null,29]
[null,"K022Abluft",36.373809935642903,50.024603709663836,50.024603709663836,49.034318413156441,49.034318413156441,45.751689630067332,45.751689630067332,null,null,30]
[null,"K011Abluft",2.2773218367353296E-3,7.7132419021791617E-4,7.7132419021791617E-4,1.1921107976766434E-4,1.1921107976766434E-4,1.8115364712567293E-4,1.8115364712567293E-4,null,null,31]
[null,"K012Abluft",1.9701704849615027,1.8918064416582625,1.8918064416582625,2.046875710470919,2.046875710470919,1.8435647552169692,1.8435647552169692,null,null,32]
[null,null,{"$f":"IFERROR(HLOOKUP($E$1,$C$6:$K$33,L6,FALSE),\"\")","v":"DAL 358800d"}]
[null,null,{"$f":"IFERROR(HLOOKUP($E$1,$C$6:$K$33,L7,FALSE),\"\")","v":"Deckenbündig"}]
["Rückgabe","K011",3.01E-4]
[null,"K012",1.68,null,null,null,null,null,null,6.6794999999999997E-3,{"$f":"0.0508/J41","v":7.6053596826109739}]
[null,"K021",-141.4]
[null,"K022",62.47]
[null,"K031",7.7669999999999996E-4]
[null,"K032",1.07]
[null,"K033",1]
[null,"K034",0.70699999999999996]
[null,"K041",6.0010000000000003E-3]
[null,"K042",0.49180000000000001]
[null,"K043",0.99829999999999997]
[null,"K051",0.22]
[null,"K052",1]
[null,"K071",1.0582894736842104E-3]
[null,"K072",0.5]
[null,"K081",2.6802631578947368E-3]
[null,"K082",0.64300000000000002]
[null,"K083",1.2869999999999999]
[null,"K091",0]
[null,"K092",8960]
[null,"K093",3]
[null,"K094",0]
[null,"K101",-0.69299999999999995]
[null,"K102",33]
[null,"K103",0.12]
[null,"K104",0.01]
[null,"K021Abluft",{"$f":"IFERROR(HLOOKUP($E$1,$C$6:$K$35,L34,FALSE),\"\")","v":0}]
[null,"K022Abluft",{"$f":"IFERROR(HLOOKUP($E$1,$C$6:$K$35,L35,FALSE),\"\")","v":0}]
[null,"K011Abluft",{"$f":"IFERROR(HLOOKUP($E$1,$C$6:$K$37,L36,FALSE),\"\")","v":0}]
[null,"K012Abluft",{"$f":"IFERROR(HLOOKUP($E$1,$C$6:$K$37,L37,FALSE),\"\")","v":0}]

{"sheet":"DRS-CAP","index":14,"n_rows":69,"n_cols":15,"rows_kept":69,"cut":false,"hidden":true,"merged":[]}
["Übergabedaten:",null,"Gewählter Durchlass",null,{"$f":"CONCATENATE(Auslegung!$D$12,Auslegung!$D$25,\"d\")","v":"DAL 358800d"}]
[null,null,"Volumenstrom",null,{"$f":"Auslegung!$D$32","v":550}]
[null,null,"Temperaturdifferenz",null,{"$f":"Auslegung!$D$35-Auslegung!$D$34","v":10}]
[null,null,"DRS","DRS","DRS","DRS","DRS","DRS","DRS","DRS","DRS","DRS","DRS","DRS",1]
[null,null,100,100,125,125,180,180,250,250,315,315,355,355,2]
[null,null,{"$f":"CONCATENATE(C4,C5,\"d\")","v":"DRS100d"},{"$f":"CONCATENATE(D4,D5,\"f\")","v":"DRS100f"},{"$f":"CONCATENATE(E4,E5,\"d\")","v":"DRS125d"},{"$f":"CONCATENATE(F4,F5,\"f\")","v":"DRS125f"},{"$f":"CONCATENATE(G4,G5,\"d\")","v":"DRS180d"},{"$f":"CONCATENATE(H4,H5,\"f\")","v":"DRS180f"},{"$f":"CONCATENATE(I4,I5,\"d\")","v":"DRS250d"},{"$f":"CONCATENATE(J4,J5,\"f\")","v":"DRS250f"},{"$f":"CONCATENATE(K4,K5,\"d\")","v":"DRS315d"},{"$f":"CONCATENATE(L4,L5,\"f\")","v":"DRS315f"},{"$f":"CONCATENATE(M4,M5,\"d\")","v":"DRS355d"},{"$f":"CONCATENATE(N4,N5,\"f\")","v":"DRS355f"},1]
[null,null,"Deckenbündig","freihängend","Deckenbündig","freihängend","Deckenbündig","freihängend","Deckenbündig","freihängend","Deckenbündig","freihängend","Deckenbündig","freihängend",2]
["Konstante","K011",6.2090000000000001E-3,5.0000000000000001E-3,2.931E-3,2.5000000000000001E-3,7.7030000000000002E-4,7.5000000000000002E-4,1.771E-4,2.22E-4,1.2750000000000001E-4,9.3800000000000003E-5,1.774E-4,5.5600000000000003E-5,3]
[null,"K012",1.944,2,1.97,2,1.9890000000000001,2,2.0350000000000001,2,1.9470000000000001,2,1.837,2,4]
[null,"K021",-63.18,-76.2,-84.65,-84.94,-124.9,-103.77,-125,-133.61000000000001,-131.80000000000001,-124.86,-140,-138.80000000000001,5]
[null,"K022",49.43,54.83,56.22,56.47,67.27,58.13,60.59,64.03,59.05,56.79,59.15,58.6,6]
[null,"K031",3.7690000000000002E-3,2.4220000000000001E-3,3.2669999999999999E-3,2.0370000000000002E-3,2.4069999999999999E-3,1.5330000000000001E-3,1.8779999999999999E-3,1.183E-3,1.5989999999999999E-3,9.8700000000000003E-4,1.405E-3,8.9999999999999998E-4,7]
[null,"K032",1.3,1.61,1.3,1.61,1.3,1.61,1.3,1.61,1.3,1.61,1.3,1.61,8]
[null,"K033",1,1,1,1,1,1,1,1,1,1,1,1,9]
[null,"K034",0.70699999999999996,null,0.70699999999999996,null,0.70699999999999996,null,0.70699999999999996,null,0.70699999999999996,null,0.70699999999999996,null,10]
[null,"K041",0.1356,null,6.13E-2,null,3.0040000000000001E-2,null,2.274E-2,null,7.9830000000000005E-3,null,5.7619999999999998E-3,null,11]
[null,"K042",0.48849999999999999,null,0.47949999999999998,null,0.50639999999999996,null,0.4642,null,0.4829,null,0.50919999999999999,null,12]
[null,"K043",0.98180000000000001,null,1.0349999999999999,null,1.0269999999999999,null,0.92330000000000001,null,1.01,null,1.0229999999999999,null,13]
[null,"K051",0.04,null,5.0999999999999997E-2,null,0.1,null,0.13,null,0.15,null,0.16,null,14]
[null,"K052",1,null,0.95899999999999996,null,1,null,1.016,null,1,null,1.016,null,15]
[null,"K071",0,null,0,null,0,null,0,null,0,null,0,null,16]
[null,"K072",0,null,0,null,0,null,0,null,0,null,0,null,17]
[null,"K081",0,null,0,null,0,null,0,null,0,null,0,null,18]
[null,"K082",0,null,0,null,0,null,0,null,0,null,0,null,19]
[null,"K083",0,null,0,null,0,null,0,null,0,null,0,null,20]
[null,"K091",0,null,0,null,0,null,0,null,0,null,0,null,21]
[null,"K092",167,null,240,null,960,null,2667,null,6000,null,8560,null,22]
[null,"K093",3,null,3,null,3,null,3,null,3,null,3,null,23]
[null,"K094",0,null,0,null,0,null,0,null,0,null,0,null,24]
[null,"K101",-0.69299999999999995,null,-0.69299999999999995,null,-0.69299999999999995,null,-0.69299999999999995,null,-0.69299999999999995,null,-0.69299999999999995,null,25]
[null,"K102",33,null,33,null,33,null,33,null,33,null,33,null,26]
[null,"K103",2.3E-2,null,2.7E-2,null,4.1000000000000002E-2,null,5.6000000000000001E-2,null,7.2999999999999995E-2,null,8.1000000000000003E-2,null,27]
[null,"K104",0.01,null,0.01,null,0.01,null,0.01,null,0.01,null,0.01,null,28]
[null,"K021Abluft",-67.264425731983408,-67.264425731983408,-88.575506739069453,-88.575506739069453,-155.01682186987338,-155.01682186987338,-175.56121712265497,-175.56121712265497,-37.533526520372661,-37.533526520372661,-131.77823837400251,-131.77823837400251,29]
[null,"K022Abluft",54.713312600496906,54.713312600496906,59.996608850894788,59.996608850894788,78.177405883609552,78.177405883609552,79.120238615184476,79.120238615184476,24.953256730211685,24.953256730211685,58.549656427178043,58.549656427178043,30]
[null,"K011Abluft",5.2817794700806605E-3,5.2817794700806605E-3,2.4721035245258783E-3,2.4721035245258783E-3,3.5292697479730737E-4,3.5292697479730737E-4,2.489870405115429E-4,2.489870405115429E-4,1.9116624308986664E-5,1.9116624308986664E-5,1.2561912817054505E-4,1.2561912817054505E-4]
[null,"K012Abluft",1.9809934495703043,1.9809934495703043,1.9265568133441886,1.9265568133441886,2.002878192933347,2.002878192933347,1.8962849861555875,1.8962849861555875,2.1632734514060856,2.1632734514060856,1.860647180864033,1.860647180864033]
[null,null,{"$f":"IFERROR(HLOOKUP($E$1,$C$6:$N$33,O6,FALSE),\"\")","v":""}]
[null,null,""]
["Rückgabe","K011",""]
[null,"K012",{"$f":"IFERROR(HLOOKUP($E$1,$C$6:$N$33,O9,FALSE),\"\")","v":""}]
[null,"K021",""]
[null,"K022",""]
[null,"K031",""]
[null,"K032",""]
[null,"K033",""]
[null,"K034",""]
[null,"K041",""]
[null,"K042",""]
[null,"K043",""]
[null,"K051",""]
[null,"K052",""]
[null,"K071",""]
[null,"K072",""]
[null,"K081",""]
[null,"K082",""]
[null,"K083",""]
[null,"K091",""]
[null,"K092",""]
[null,"K093",{"$f":"IFERROR(HLOOKUP($E$1,$C$6:$N$33,O28,FALSE),\"\")","v":""}]
[null,"K094",""]
[null,"K101",""]
[null,"K102",""]
[null,"K103",""]
[null,"K104",""]
[null,"K021Abluft",{"$f":"IFERROR(HLOOKUP($E$1,$C$6:$N$35,O34,FALSE),\"\")","v":""}]
[null,"K022Abluft",{"$f":"IFERROR(HLOOKUP($E$1,$C$6:$N$37,O35,FALSE),\"\")","v":""}]
[null,"K011Abluft",{"$f":"IFERROR(HLOOKUP($E$1,$C$6:$N$37,O36,FALSE),\"\")","v":""}]
[null,"K012Abluft",""]

{"sheet":"DIA-CAP","index":15,"n_rows":69,"n_cols":21,"rows_kept":69,"cut":false,"hidden":true,"merged":[[7,14,7,19],[8,14,8,19],[9,14,9,19],[10,14,10,19],[3,14,3,19]]}
["Übergabedaten:",null,"Gewählter Durchlass",null,{"$f":"CONCATENATE(Auslegung!$D$12,Auslegung!$D$25,\"d\")","v":"DAL 358800d"}]
[null,null,"Volumenstrom",null,{"$f":"Auslegung!$D$32","v":550}]
[null,null,"Temperaturdifferenz",null,{"$f":"Auslegung!$D$35-Auslegung!$D$34","v":10}]
[null,null,"DIA","DIA","DIA","DIA","DIA","DIA","DIA","DIA","DIA","DIA","DIA","DIA","DIA"]
[null,null,100,100,125,125,180,180,250,250,315,315,355,355,100,125,180,250,315,355]
[null,null,{"$f":"CONCATENATE(C4,C5,\"d\")","v":"DIA100d"},{"$f":"CONCATENATE(D4,D5,\"f\")","v":"DIA100f"},{"$f":"CONCATENATE(E4,E5,\"d\")","v":"DIA125d"},{"$f":"CONCATENATE(F4,F5,\"f\")","v":"DIA125f"},{"$f":"CONCATENATE(G4,G5,\"d\")","v":"DIA180d"},{"$f":"CONCATENATE(H4,H5,\"f\")","v":"DIA180f"},{"$f":"CONCATENATE(I4,I5,\"d\")","v":"DIA250d"},{"$f":"CONCATENATE(J4,J5,\"f\")","v":"DIA250f"},{"$f":"CONCATENATE(K4,K5,\"d\")","v":"DIA315d"},{"$f":"CONCATENATE(L4,L5,\"f\")","v":"DIA315f"},{"$f":"CONCATENATE(M4,M5,\"d\")","v":"DIA355d"},{"$f":"CONCATENATE(N4,N5,\"f\")","v":"DIA355f"},null,null,null,null,null,null,1]
[null,null,"Deckenbündig","freihängend","Deckenbündig","freihängend","Deckenbündig","freihängend","Deckenbündig","freihängend","Deckenbündig","freihängend","Deckenbündig","freihängend",null,null,null,null,null,null,2]
["Konstante","K011",6.2090000000000001E-3,5.0000000000000001E-3,2.931E-3,2.5000000000000001E-3,7.7030000000000002E-4,7.5000000000000002E-4,1.771E-4,2.22E-4,1.2750000000000001E-4,9.3800000000000003E-5,1.774E-4,5.5600000000000003E-5,"Verwendung des DRS-Konstantensatzes, ",null,null,null,null,null,3]
[null,"K012",1.944,2,1.97,2,1.9890000000000001,2,2.0350000000000001,2,1.9470000000000001,2,1.837,2,"Erhöhung des Druckverlustes um Faktor 1,1 bei gleichem Volumenstrom",null,null,null,null,null,4]
[null,"K021",-60.68,-73.7,-82.15,-82.44,-122.4,-101.27,-122.5,-131.11000000000001,-129.30000000000001,-122.36,-137.5,-133.80000000000001,"Verwendung des DRS-Konstantensatzes, ",null,null,null,null,null,5]
[null,"K022",49.43,54.83,56.22,56.47,67.27,58.13,60.59,64.03,59.05,56.79,59.15,58.6,"Erhöhung des Schallleistungspegels um 2,5 dB",null,null,null,null,null,6]
[null,"K031",3.7690000000000002E-3,2.4220000000000001E-3,3.2669999999999999E-3,2.0370000000000002E-3,2.4069999999999999E-3,1.5330000000000001E-3,1.8779999999999999E-3,1.183E-3,1.5989999999999999E-3,9.8700000000000003E-4,1.405E-3,8.9999999999999998E-4,null,null,null,null,null,null,7]
[null,"K032",1.3,1.61,1.3,1.61,1.3,1.61,1.3,1.61,1.3,1.61,1.3,1.61,null,null,null,null,null,null,8]
[null,"K033",1,1,1,1,1,1,1,1,1,1,1,1,"Hinweise:","Korrektur Totaldruck in Arbeitsblatt \"Grunddaten\"",null,null,null,null,9]
[null,"K034",0.70699999999999996,null,0.70699999999999996,null,0.70699999999999996,null,0.70699999999999996,null,0.70699999999999996,null,0.70699999999999996,null,null,"Korrektur Schallleistungspegel hier durchgeführt",null,null,null,null,10]
[null,"K041",0.1356,null,6.13E-2,null,3.0040000000000001E-2,null,2.274E-2,null,7.9830000000000005E-3,null,5.7619999999999998E-3,null,null,null,null,null,null,null,11]
[null,"K042",0.48849999999999999,null,0.47949999999999998,null,0.50639999999999996,null,0.4642,null,0.4829,null,0.50919999999999999,null,null,null,null,null,null,null,12]
[null,"K043",0.98180000000000001,null,1.0349999999999999,null,1.0269999999999999,null,0.92330000000000001,null,1.01,null,1.0229999999999999,null,null,null,null,null,null,null,13]
[null,"K051",0.04,null,5.0999999999999997E-2,null,0.1,null,0.13,null,0.15,null,0.16,null,null,null,null,null,null,null,14]
[null,"K052",1,null,0.95899999999999996,null,1,null,1.016,null,1,null,1.016,null,null,null,null,null,null,null,15]
[null,"K071",0,null,0,null,0,null,0,null,0,null,0,null,null,null,null,null,null,null,16]
[null,"K072",0,null,0,null,0,null,0,null,0,null,0,null,null,null,null,null,null,null,17]
[null,"K081",0,null,0,null,0,null,0,null,0,null,0,null,null,null,null,null,null,null,18]
[null,"K082",0,null,0,null,0,null,0,null,0,null,0,null,null,null,null,null,null,null,19]
[null,"K083",0,null,0,null,0,null,0,null,0,null,0,null,null,null,null,null,null,null,20]
[null,"K091",0,null,0,null,0,null,0,null,0,null,0,null,null,null,null,null,null,null,21]
[null,"K092",167,null,240,null,960,null,2667,null,6000,null,8560,null,null,null,null,null,null,null,22]
[null,"K093",3,null,3,null,3,null,3,null,3,null,3,null,null,null,null,null,null,null,23]
[null,"K094",0,null,0,null,0,null,0,null,0,null,0,null,null,null,null,null,null,null,24]
[null,"K101",-0.69299999999999995,null,-0.69299999999999995,null,-0.69299999999999995,null,-0.69299999999999995,null,-0.69299999999999995,null,-0.69299999999999995,null,null,null,null,null,null,null,25]
[null,"K102",33,null,33,null,33,null,33,null,33,null,33,null,null,null,null,null,null,null,26]
[null,"K103",2.3E-2,null,2.7E-2,null,4.1000000000000002E-2,null,5.6000000000000001E-2,null,7.2999999999999995E-2,null,8.1000000000000003E-2,null,null,null,null,null,null,null,27]
[null,"K104",0.01,null,0.01,null,0.01,null,0.01,null,0.01,null,0.01,null,null,null,null,null,null,null,28]
[null,"K021Abluft",null,null,null,null,null,null,null,null,null,null,null,null,null,null,null,null,null,null,29]
[null,"K022Abluft",null,null,null,null,null,null,null,null,null,null,null,null,null,null,null,null,null,null,30]
[null,"K011Abluft"]
[null,"K012Abluft"]
[null,null,{"$f":"IFERROR(HLOOKUP($E$1,$C$6:$N$37,U6,FALSE),\"\")","v":""}]
[null,null,{"$f":"IFERROR(HLOOKUP($E$1,$C$6:$N$37,U7,FALSE),\"\")","v":""}]
["Rückgabe","K011",""]
[null,"K012",""]
[null,"K021",""]
[null,"K022",""]
[null,"K031",""]
[null,"K032",""]
[null,"K033",""]
[null,"K034",""]
[null,"K041",""]
[null,"K042",""]
[null,"K043",""]
[null,"K051",""]
[null,"K052",""]
[null,"K071",""]
[null,"K072",""]
[null,"K081",""]
[null,"K082",""]
[null,"K083",""]
[null,"K091",""]
[null,"K092",""]
[null,"K093",""]
[null,"K094",""]
[null,"K101",""]
[null,"K102",""]
[null,"K103",""]
[null,"K104",""]
[null,"K021Abluft",""]
[null,"K022Abluft",{"$f":"IFERROR(HLOOKUP($E$1,$C$6:$N$37,U35,FALSE),\"\")","v":""}]
[null,"K011Abluft",{"$f":"IFERROR(HLOOKUP($E$1,$C$6:$N$37,U36,FALSE),\"\")","v":""}]
[null,"K012Abluft",""]

{"sheet":"MSA-CAP","index":16,"n_rows":69,"n_cols":13,"rows_kept":69,"cut":false,"hidden":true,"merged":[[20,11,24,11]]}
["Übergabedaten:",null,"Gewählter Durchlass",null,{"$f":"CONCATENATE(Auslegung!$D$12,Auslegung!$D$25)","v":"DAL 358800"}]
[null,null,"Volumenstrom",null,{"$f":"Auslegung!$D$32","v":550},null,null,null,null,"Konstantenerrechnung K031-K034 erfolgt über spezifische Volumenströme mit Auslegungskonstanten SAL35"]
[null,null,"Temperaturdifferenz",null,{"$f":"Auslegung!$D$35-Auslegung!$D$34","v":10},null,null,null,null,"Konstanten für die Auslegung stammen vom SAL35!"]
[null,null,"MSA","MSA","MSA","MSA","MSA-V",null,null,"Für die Berechnungen in dieser Arbeitsmappe wurde K031 erweitert auf K031(neu) = K031(SAL35)*Wurzel(Schlitzanzahl)*1/aktive Länge"]
[null,null,300,400,500,600,null,null,null,"K041 wurde ebenfalls angepasst nach K041(neu)=K041(alt)*Wurzel(Schlitzanzahl)*(1/aktive Länge)"]
[null,null,{"$f":"CONCATENATE(C4,C5)","v":"MSA300"},{"$f":"CONCATENATE(D4,D5)","v":"MSA400"},"MSA500","MSA600","MSA-V",1]
[null,null,null,null,null,null,null,2,null,null,"A1/F6"]
["Konstante","K011",9.5575118337991251E-4,2.1898235307689197E-4,3.4357704076325938E-4,6.2897147110562546E-5,5.9748815137567469E-5,3,null,null,2.5200000000000001E-3,null,"Daten für Druckverlust und Schallleistung beruhen auf Katalogangaben!"]
[null,"K012",2.0139004770944648,2.0392900564723835,1.7181591684097095,1.872375326524196,1.9178513948119098,4,null,null,1.92]
[null,"K021",-102.89108412925144,-124.04972114709894,-116.91527170898351,-140.78516782633633,-120.70057428544176,5,null,null,-75.599999999999994]
[null,"K022",60.560770981134887,65.35058245929325,56.589666454135127,62.432981117219406,53.47757548461886,6,null,null,53.72]
[null,"K031",6.4224324594310302E-3,4.2693790199137722E-3,2.8025249313884302E-3,2.1759360269426103E-3,null,7,null,null,5.0270000000000002E-3]
[null,"K032",1,1,1,1,null,8,null,null,5.8]
[null,"K033",1.0074999967909215,1.0199155259013248,0.99880404948741941,1.0319284706827219,null,9,null,null,0.5]
[null,"K034",1,1,1,1,null,10,null,null,0.70699999999999996]
[null,"K041",4.6186298536629145E-2,2.9238506115895936E-2,2.4056493500857895E-2,1.0704162579691813E-2,null,11,null,null,8.8200000000000001E-2]
[null,"K042",0.47346217779012989,0.4610764903286716,0.47527834470737218,0.46965976974571966,null,12,null,null,0.64300000000000002]
[null,"K043",0.98484900749254711,0.97465926308787598,0.94481334081899992,0.98297716696001025,null,13,null,null,1.2869999999999999]
[null,"K051",4.9660000000000003E-2,4.9660000000000003E-2,4.9660000000000003E-2,4.9660000000000003E-2,null,14,null,null,4.9660000000000003E-2]
[null,"K052",0.5,0.5,0.5,0.5,null,15,null,null,0.5]
[null,"K071",{"$f":"$K$21*SQRT(6)*(1/1.2)","v":1.641770500100425E-2},{"$f":"$K$21*SQRT(8)*(1/2.4)","v":9.4787664018056699E-3},{"$f":"$K$21*SQRT(12)*(1/4.8)","v":5.8045352688651996E-3},{"$f":"$K$21*SQRT(14)*(1/7)","v":4.2991643374032584E-3},null,16,null,null,8.0429999999999998E-3,"Heizfallkonstanten SAL 35 aus CAP"]
[null,"K072",0.5,0.5,0.5,0.5,null,17,null,null,0.5]
[null,"K081",{"$f":"$K$23*SQRT(6)*(1/1.2)","v":4.158008838374444E-2},{"$f":"$K$23*SQRT(8)*(1/2.4)","v":2.4006275221283287E-2},{"$f":"$K$23*SQRT(12)*(1/4.8)","v":1.4700781229240845E-2},{"$f":"$K$23*SQRT(14)*(1/7)","v":1.0888222995512169E-2},null,18,null,null,2.0369999999999999E-2,null,"K081 wurde angepasst nach K081(neu)=K081(alt)*Wurzel(Schlitzanzahl)*(1/aktive Länge)"]
[null,"K082",0.64300000000000002,0.64300000000000002,0.64300000000000002,0.64300000000000002,null,19,null,null,0.64300000000000002]
[null,"K083",1.2869999999999999,1.2869999999999999,1.2869999999999999,1.2869999999999999,null,20,null,null,1.2869999999999999]
[null,"K091",0,0,0,0,null,21,null,null,0]
[null,"K092",47,47,47,47,null,22,null,null,47]
[null,"K093",2.5,2.5,2.5,2.5,null,23,null,null,2.5]
[null,"K094",0,0,0,0,null,24,null,null,0]
[null,"K101",-0.69299999999999995,-0.69299999999999995,-0.69299999999999995,-0.69299999999999995,null,25,null,null,-0.69299999999999995]
[null,"K102",24,24,24,24,null,26,null,null,24]
[null,"K103",7.0000000000000001E-3,7.0000000000000001E-3,7.0000000000000001E-3,7.0000000000000001E-3,null,27,null,null,7.0000000000000001E-3]
[null,"K104",0.01,0.01,0.01,0.01,null,28,null,null,0.01]
[null,"K021Abluft",-103.94026648149726,-121.01046508924843,-151.35181645476121,-140.90268033600105,null,29]
[null,"K022Abluft",64.670100161620326,64.171899188115077,69.869216437746232,63.097564584272774,null,30]
[null,"K011Abluft",3.73051103351259E-3,7.6429078770234946E-4,7.5878647096808003E-5,4.5711902171496407E-5,null,31]
[null,"K012Abluft",1.7828094624395789,1.8282435380835766,2.0144842208269549,1.9830324271280104,null,32]
[null,null,{"$f":"IFERROR(HLOOKUP($E$1,$C$6:$F$33,H6,FALSE),\"\")","v":""}]
[null,null,{"$f":"IFERROR(HLOOKUP($E$1,$C$6:$F$33,H7,FALSE),\"\")","v":""}]
["Rückgabe","K011",""]
[null,"K012",""]
[null,"K021",""]
[null,"K022",""]
[null,"K031",""]
[null,"K032",""]
[null,"K033",""]
[null,"K034",""]
[null,"K041",""]
[null,"K042",""]
[null,"K043",""]
[null,"K051",""]
[null,"K052",""]
[null,"K071",""]
[null,"K072",""]
[null,"K081",""]
[null,"K082",""]
[null,"K083",""]
[null,"K091",""]
[null,"K092",""]
[null,"K093",""]
[null,"K094",""]
[null,"K101",""]
[null,"K102",""]
[null,"K103",""]
[null,"K104",""]
[null,"K021Abluft",{"$f":"IFERROR(HLOOKUP($E$1,$C$6:$F$35,H34,FALSE),\"\")","v":""}]
[null,"K022Abluft",{"$f":"IFERROR(HLOOKUP($E$1,$C$6:$F$35,H35,FALSE),\"\")","v":""}]
[null,"K011Abluft",{"$f":"IFERROR(HLOOKUP($E$1,$C$6:$F$37,H36,FALSE),\"\")","v":""}]
[null,"K012Abluft",{"$f":"IFERROR(HLOOKUP($E$1,$C$6:$F$37,H37,FALSE),\"\")","v":""}]