{"text_format":"1","workbook":"xlsx","n_sheets":14,"sheets":["Version","Hinweise zum Programm","Auslegung","Datenblatt","Grunddaten","Lw","DR","xkr._vx","Eingabe","RS-CAP","RM-CAP","RL-CAP","V-CAP","Q-CAP"],"not_rendered":{"charts":0,"images":14,"macros":1,"external_links":0,"defined_names":2,"comments":1,"pivot_tables":0},"unopened":[],"bounds":{"document_bytes":16777216,"sheet_cells":100000,"rows_first":2000,"rows_last":500,"rows_between":2000,"halvings":0,"cell_chars":16384,"cell_head_chars":4096},"cells_cut":0,"cells_raw":0,"read":"whole","date_system":"1900"}

{"sheet":"Version","index":0,"n_rows":2,"n_cols":2,"rows_kept":2,"cut":false,"hidden":true,"merged":[]}
["Service",{"$f":"MID(CELL(\"dateiname\"),FIND(\"[\",CELL(\"dateiname\"))+1,FIND(\"]\",CELL(\"dateiname\"))-FIND(\"[\",CELL(\"dateiname\"))-1)","v":"test.xlsm"}]
["Version:","1.0"]

{"sheet":"Hinweise zum Programm","index":1,"n_rows":22,"n_cols":1,"rows_kept":22,"cut":false,"hidden":false,"merged":[]}
["Hinweise zur Bedienung"]
[]
["Allgemeine Hinweise:"]
["Das Auslegungstool Draller dient als Hilfsmittel zur Technischen Planung des emcoair KSW. "]
[]
["Auslegung:"]
["Im Tabellenblatt \"Auslegung\" erfolgt die Festlegung des gewünschten Auslasstyps. Bei Eingabe der Vorgabedaten, wie z.B. dem benötigten Luftvolumenstrom werden die technischen Daten des gewählten Luftdurchlasses berechnet."]
[]
["Strömungsformen:"]
["Die im Tabellenblatt \"Auslegung\" ermittelten Strömungsgeschwindigkeiten gelten für einen deckenbündig montierten Luftdurchlass mit horizontaler Ausblascharakteristik. "]
[]
["Funktion:"]
["Im Tabellenblatt \"Funktion\" finden Sie eine kurze Funktionsbeschreibung zum emcoair KSW."]
[]
["Maße:"]
["Das Tabellenblatt \"Maße\" gibt einen Überblick über die wählbare Größen und Varianten des emcoair KSW mit detaillierten Bemaßungen."]
[]
["Hinweise zur Funktion:"]
["Für eine ordnungsgemäße Funktion des Auslegungstools muss die Ausführung von Makros und MS Excel aktiviert sein. Die Aktivierung von Makros erfolgt im Menü Makrosicherheit."]
["Einstellung unter MS Excel 97-2003: Extras → Makro → Sicherheit"]
["Einstellung unter MS Excel 2007: Entwicklertools* → Makrosicherheit  "]
["*Das Menü Entwicklertools muss unter Umständen eingefügt werden unter Excel-Optionen"]

{"sheet":"Auslegung","index":2,"n_rows":131,"n_cols":12,"rows_kept":131,"cut":false,"hidden":false,"merged":[[115,3,115,4],[43,0,43,4],[114,3,114,4],[100,4,110,4],[39,3,39,4],[96,1,96,4],[92,1,92,4],[87,1,87,4],[84,1,84,4],[73,0,73,4],[74,1,74,4],[83,1,83,4],[89,1,89,4],[41,3,41,4],[36,3,36,4],[79,1,79,4],[78,1,78,4],[40,3,40,4],[69,3,69,4],[72,3,72,4],[24,5,24,6],[0,0,0,3],[35,0,35,4],[44,3,44,4],[7,3,7,4],[5,0,5,4],[11,3,11,4],[17,3,17,4],[31,3,31,4],[33,3,33,4],[32,3,32,4],[6,3,6,4],[34,3,34,4],[24,3,24,4],[37,3,37,4],[38,3,38,4]]}
["Auslegung Kampmann MPC"]
[]
["Eingabefelder sind gelb gekennzeichnet"]
["Ergebnisfelder sind blau gekennzeichnet"]
[]
["Vorgaben"]
["Strömungstechnik","Symbol","Einheit","Wert"]
["Bezeichung","Symbol","Einheit"]
[null,"L","mm"]
[null,"L","mm"]
[null,"L","mm"]
["Durchlass Typ",null,null,"MPC-R-M"]
[null,null,null,"MPC-Q"]
[null,null,null,"MPC-R-S"]
[null,null,null,"MPC-R-M"]
[null,null,null,"MPC-R-L"]
[null,null,null,"MPC-V"]
["Nenn-Abmessung Frontblende","DN","[-]",600]
[null,null,null,{"$f":"IF(OR(D12=\"MPC-R-S\",D12=\"MPC-V\",D12=\"MPC-Q\"),300,\"\")","v":""}]
[null,null,null,600]
[null,null,null,625]
[]
[]
[]
["Durchmesser Anschlussstutzen","DN","[-]",250,null,161]
[null,null,null,{"$f":"IF($D$18=300,100,IF(OR($D$18=600,$D$18=625),\"\",\"\"))","v":""}]
[null,null,null,{"$f":"IF($D$18=300,125,IF(OR($D$18=600,$D$18=625),125,\"\"))","v":125}]
[null,null,null,{"$f":"IF($D$18=300,160,IF(OR($D$18=600,$D$18=625),160,\"\"))","v":160}]
[null,null,null,{"$f":"IF($D$18=300,\"\",IF(OR($D$18=600,$D$18=625),200,\"\"))","v":200}]
[null,null,null,{"$f":"IF($D$18=300,\"\",IF(OR($D$18=600,$D$18=625),225,\"\"))","v":225}]
[null,null,null,{"$f":"IF($D$18=300,\"\",IF(OR($D$18=600,$D$18=625),250,\"\"))","v":250}]
["Luftvolumenstrom","V·SUP","m³/h",490]
["max. Luftgeschwindigkeit im Aufenthaltsbereich","vMax","m/s",0.2]
["Temperatur Zuluft","tSUP","°C",18]
["Temperatur Raum","tRaum","°C",26]
["Raumdaten"]
["Raumhöhe","H1","m",3]
["Obergrenze Aufenthaltsbereich","H2","m",1.8]
["Raumlänge","LR","m",7,null,null,null,null,1,"Breite Frontblende",{"$f":"Grunddaten!$S$141","v":595},"mm"]
["Raumbreite","BR","m",10,null,null,null,null,2,"Höhe Anschlusskasten",{"$f":"Grunddaten!$R$141","v":300},"mm"]
["Abstand Durchlass zur nächstgelegenen Wand","a","m",6,null,null,null,null,3,"Durchmesser Anschlussstutzen",{"$f":"Grunddaten!$T$141","v":248},"mm"]
["kleinster Abstand zwischen 2 Durchlässen","smin","m",2,null,null,null,null,4,"Minimaler Volumenstrom",{"$f":"Grunddaten!$U$141","v":200},"m³/h"]
[null,null,null,null,null,null,null,null,5,"Maximaler Volumenstrom",{"$f":"Grunddaten!$V$141","v":450},"m³/h"]
["Akustikdaten"]
["Raumart nach VDI 2081",null,null,"Konferenzraum"]
[null,null,"Einzelbüro"]
[null,null,"Großraumbüro"]
[null,null,"Werkstätten"]
[null,null,"Ruheraum, Pausenraum"]
[null,null,"Untersuchungsraum Krankenhaus"]
[null,null,"Rundfunk-, Fernsehstudio"]
[null,null,"Chemielabor"]
[null,null,"Wasch- und WC-Raum, Umkleide"]
[null,null,"Schwimmbad"]
[null,null,"EDV-Raum"]
[null,null,"Konzertsaal"]
[null,null,"Lesesaal"]
[null,null,"Museum"]
[null,null,"Küche"]
[null,null,"Theater, Kino"]
[null,null,"Klassen- Seminarraum"]
[null,null,"Gaststätte"]
[null,null,"kein Typ"]
[null,null,"Konferenzraum"]
[null,null,"Hotelzimmer"]
[null,null,"Hörsaal"]
[null,null,"Bettenzimmer Krankenhaus"]
[null,null,"Verkaufsraum"]
[null,"","Sporthalle"]
["Betrachteter Durchlass",null,null,"Zuluft"]
[null,null,null,"Zuluft"]
[null,null,null,"Abluft"]
["Abstand zur Schallquelle","r","m",5]
["Zusatzdaten"]
["Funktion","",null,null,null,{"$f":"VLOOKUP(B75,Eingabe!$A$45:$B$48,2,FALSE)","v":{"$error":"#N/A"}},{"$f":"VLOOKUP($B$75,$B$76:$G$78,6,0)","v":"Z"}]
[null,{"$f":"IF(D12=500,\"Zuluft\",\"\")","v":""},null,null,null,null,"Z"]
[null,{"$f":"IF(D12=500,\"Abluft\",\"\")","v":""},null,null,null,null,"A"]
[null,{"$f":"IF(D12>500,\"Zuluft/Abluft-Kombination\",\"\")","v":"Zuluft/Abluft-Kombination"},null,null,null,null,"K"]
["Farbe Abdeckprofil und Endwinkel",9010,null,null,null,{"$f":"VLOOKUP(B79,Eingabe!A45:B48,2,FALSE)","v":{"$error":"#N/A"}},{"$f":"$B$79","v":9010}]
["Farbe Luftlenkelement","schwarz",null,null,null,null,{"$f":"VLOOKUP(B80,B81:G83,6,FALSE)","v":"S"}]
[null,"schwarz",null,null,null,null,"S"]
[null,"weiß",null,null,null,null,"W"]
[null,"grau",null,null,null,null,"G"]
["Einstellung Luftlenkelement","Deckenstrahl D / E",null,null,null,null,{"$f":"VLOOKUP(B84,B85:G88,6,FALSE)","v":"D"}]
[null,"Deckenstrahl D / E",null,null,null,null,"D"]
[null,"Sondereinstellung",null,null,null,null,"S"]
[]
["Werkstoff Anschlusskasten","Stahl verzinkt",null,null,null,null,"V"]
[null,"Stahl verzinkt"]
["frontseitig bedienbare Drossel","ohne",null,null,null,{"$f":"VLOOKUP(B90,Eingabe!$A$45:$B$51,2,FALSE)","v":{"$error":"#N/A"}},{"$f":"VLOOKUP(B90,B91:G93,6,FALSE)","v":0}]
[null,"mit",null,null,null,null,1]
[null,"ohne",null,null,null,null,0]
["Innenauskleidung","Baustoffklasse B1 (Standard)",null,null,null,null,{"$f":"VLOOKUP(B93,B94:G97,6,FALSE)","v":"B1"}]
[null,"Baustoffklasse B1 (Standard)",null,null,null,null,"B1"]
[null,"Baustoffklasse A2 (optional)",null,null,null,null,"A2"]
[]
["Merkmalschlüssel",{"$f":"CONCATENATE(1,\"KSW\",\"0\",D18,G97,G75,\"A\",G79,G80,G84,G88,G90,G93,1,G98)","v":"1KSW0600MPC-R-MZA9010SDV0B11100"},null,null,null,null,{"$f":"IF(D12<1000,CONCATENATE(0,D12),D12)","v":"MPC-R-M"}]
[null,null,null,null,null,null,{"$f":"IF(K41=78,\"080\",100)","v":100}]
["Berechnung strömungstechnische und Akustische Daten",null,null,"Zuluft","Abluft"]
["Druckverlust","Dpt","Pa",{"$f":"IF(D70=\"Zuluft\",Grunddaten!I141,\"\")","v":36.74032733775487},{"$f":"IF(D70=\"Abluft\",IF(Grunddaten!I142=0,\"a. Anf\",Grunddaten!I142),\"\")","v":""}]
["kritischer Strahlweg","xkr.","m",{"$f":"IF(D70=\"Zuluft\",IF(D12=\"MPC-V\",\"a. Anf\",IF(D34>=D35,\"Heizfall\",xkr._vx!$F$11)),\"\")","v":1.895397350899152}]
["Laufweg bis Fußbodenbereich","xx","m",{"$f":"xkr._vx!L24","v":9.5}]
["Laufweg bis Aufenthaltsbereich nach Stoßpunkt","xx+y","m",{"$f":"xkr._vx!L26","v":2.2000000000000002}]
["Laufweg bis Aufenthaltsbereich nach xkrit","xxkr","m",{"$f":"IF(D34>=D35,\"Heizfall\",xkr._vx!L28)","v":3.5924536257468658}]
["Geschwindigkeit im Fußbodenbereich in Wandnähe","vx1","m/s",{"$f":"IF(D70=\"Zuluft\",IF(D12=\"MPC-V\",\"a. Anf\",IF(xkr._vx!$N$24< 0.1,\"< 0,1\",xkr._vx!$N$24)),\"\")","v":"< 0,1"}]
["Zugluftrisiko am Fußboden**","DR1","%",{"$f":"IF(D70=\"Zuluft\",IF(D12=\"MPC-V\",\"a. Anf\",IF($D$34>$D$35,\"Heizfall\",DR!$C$16)),\"\")","v":0}]
[{"$f":"IF(D12=\"MPC-Q\",\"Geschwindigkeit unterhalb des Druchlasses\",\"Geschwindigkeit im Aufenthaltsbereich*\")","v":"Geschwindigkeit im Aufenthaltsbereich*"},"vx2",{"$f":"IF(AND(D35<=D34,D12=\"MSA\"),\"m\",\"m/s\")","v":"m/s"},{"$f":"IF(D70=\"Zuluft\",IF(D12=\"MPC-V\",\"a. Anf\",IF($D$12=\"MPC-Q\",xkr._vx!$N$31,IF(xkr._vx!$N$26<0.1,\"< 0,1\",xkr._vx!$N$26))),\"\")","v":0.10289682405460553}]
["Zugluftrisiko im Aufenthaltsbereich**","DR2","%",{"$f":"IF(D70=\"Zuluft\",IF(D12=\"MPC-V\",\"a. Anf\",IF($D$34>$D$35,\"Heizfall\",DR!$C$24)),\"\")","v":6.8789311830925861}]
["Geschwindigkeit nach Ablösen an Xkr.","vx3","m/s",{"$f":"IF(D70=\"Zuluft\",IF(D12=\"MPC-V\",\"a. Anf\",IF(xkr._vx!N28<0.1,\"<0,1\",IF($D$34>=$D$35,\"Heizfall\",xkr._vx!$N$28))),\"\")","v":"<0,1"}]
["Zugluftrisiko nach Ablösepunkt**","DR3","%",{"$f":"IF(D70=\"Zuluft\",IF(D12=\"MPC-V\",\"a. Anf\",IF($D$34>=$D$35,\"Heizfall\",DR!$C$32)),\"\")","v":6.0440349022645217}]
["Resultierende Raumkategorie","RAL","[-]",{"$f":"IF(D70=\"Zuluft\",IF(D12=\"MPC-V\",\"a. Anf\",IF(D34>=D35,\"Heizfall\",IF(AND($D$106<9.95,$D$108<9.95,$D$110<9.95),\"A\",IF(AND($D$106<19.95,$D$108<19.95,$D$110<19.95),\"B\",IF(AND($D$106<29.95,$D$108<29.95,$D$110<29.95),\"C\",\"Außerhalb C\"))))),\"\")","v":"A"}]
[{"$f":"CONCATENATE(\"Schallleistungspegel, \",D70,\"durchlass\")","v":"Schallleistungspegel, Zuluftdurchlass"},"LWA_SUP/ETA","dB(A)",{"$f":"IF(D70=\"Zuluft\",IF(Lw!K521<25,\"<25\",Lw!K521),\"\")","v":41.581280489233833},{"$f":"IF(D70=\"Abluft\",IF(Lw!K522<25,\"<25\",Lw!K522),\"\")","v":""}]
["Schallleistungspegel, Zahlenwert Zuluft + Abluft",null,null,{"$f":"Lw!$K$521","v":41.581280489233833},{"$f":"Lw!K522","v":25.150966509687301}]
[{"$f":"CONCATENATE(\"Schallldruckpegel in \",D73,\"m Entfernung, \",D70,\"durchlass\")","v":"Schallldruckpegel in 5m Entfernung, Zuluftdurchlass"},"LPA_SUP/ETA","dB(A)",{"$f":"IF(D70=\"Zuluft\",IF(D112=\"<25\",\"<25\",IF(D112+10*LOG(Lw!$H$575/(4*PI()*Auslegung!D73^2)+4/(Lw!$J$575))>=25,D112+10*LOG(Lw!$H$575/(4*PI()*Auslegung!D73^2)+4/(Lw!$J$575)),\"<25\")),\"\")","v":34.054264326627745},{"$f":"IF(D70=\"Abluft\",IFERROR(IF(E112=\"<25\",\"<25\",IF(E112+10*LOG(Lw!$H$575/(4*PI()*Auslegung!D73^2)+4/(Lw!$J$575))>=25,E112+10*LOG(Lw!$H$575/(4*PI()*Auslegung!D73^2)+4/(Lw!$J$575)),\"<25\")),\"a. Anf\"),\"\")","v":""}]
["Schalldruckpegel rechnerisch ",null,null,{"$f":"IF(10*LOG(10^(D113/10)+10^(E113/10))<25,\"<25\",10*LOG(10^(D113/10)+10^(E113/10)))","v":41.678972523987397}]
["Summen-Schallldruckpegel im betrachteten Punkt","LPA","dB(A)",{"$f":"IFERROR(IF(E113-D113>6,MAX(E113,D113),D115),IF(E114=\"a. Anf\",D114,IF(AND(D114=\"<25\",E114=\"<25\"),\"<25\",\"a. Anf\")))","v":41.678972523987397}]
["*Gilt für Eintritt der Luftströmung in den Aufenthaltbereich nach dem Stoßpunkt"]
["** Berechnung gemäß DIN EN ISO 7730"]
[]
["Oktavspektrum Schallleistung","LW_Okt","dB",{"$f":"D99","v":"Zuluft"},{"$f":"E99","v":"Abluft"}]
[null,"LW_125","dB",{"$f":"IF($D$70=\"Zuluft\",IF($D$113<25,\"\",IFERROR(Lw!M$522,\"a. Anf\")),\"\")","v":43.306152444398307},{"$f":"IF($D$70=\"Abluft\",IF($E$113<25,\"\",IFERROR(Lw!M$523,\"a. Anf\")),\"\")","v":""}]
[null,"LW_250","dB",{"$f":"IF($D$70=\"Zuluft\",IF($D$113<25,\"\",IFERROR(Lw!N$522,\"a. Anf\")),\"\")","v":39.505519542826939},{"$f":"IF($D$70=\"Abluft\",IF($E$113<25,\"\",IFERROR(Lw!N$523,\"a. Anf\")),\"\")","v":""}]
[null,"LW_500","dB",{"$f":"IF($D$70=\"Zuluft\",IF($D$113<25,\"\",IFERROR(Lw!O$522,\"a. Anf\")),\"\")","v":39.097211623437737},{"$f":"IF($D$70=\"Abluft\",IF($E$113<25,\"\",IFERROR(Lw!O$523,\"a. Anf\")),\"\")","v":""}]
[null,"LW_1000","dB",{"$f":"IF($D$70=\"Zuluft\",IF($D$113<25,\"\",IFERROR(Lw!P$522,\"a. Anf\")),\"\")","v":38.130825576990105},{"$f":"IF($D$70=\"Abluft\",IF($E$113<25,\"\",IFERROR(Lw!P$523,\"a. Anf\")),\"\")","v":""}]
[null,"LW_2000","dB",{"$f":"IF($D$70=\"Zuluft\",IF($D$113<25,\"\",IFERROR(Lw!Q$522,\"a. Anf\")),\"\")","v":31.187593454255936},{"$f":"IF($D$70=\"Abluft\",IF($E$113<25,\"\",IFERROR(Lw!Q$523,\"a. Anf\")),\"\")","v":""}]
[null,"LW_4000","dB",{"$f":"IF($D$70=\"Zuluft\",IF($D$113<25,\"\",IFERROR(Lw!R$522,\"a. Anf\")),\"\")","v":24.25700115341154},{"$f":"IF($D$70=\"Abluft\",IF($E$113<25,\"\",IFERROR(Lw!R$523,\"a. Anf\")),\"\")","v":""}]
[null,"LW_8000","dB",{"$f":"IF($D$70=\"Zuluft\",IF($D$113<25,\"\",IFERROR(Lw!S$522,\"a. Anf\")),\"\")","v":23.555303026490385},{"$f":"IF($D$70=\"Abluft\",IF($E$113<25,\"\",IFERROR(Lw!S$523,\"a. Anf\")),\"\")","v":""}]
[]
["Änderungen vorbehalten"]
["Stand:",null,null,null,{"$f":"IF(D12=500,KSW(),\"\")","v":""}]
[{"$f":"Grunddaten!B136","v":"2020-10-30"}]

{"sheet":"Datenblatt","index":3,"n_rows":41,"n_cols":9,"rows_kept":41,"cut":false,"hidden":false,"merged":[[34,2,34,3],[34,5,34,6],[33,2,33,3],[33,5,33,6],[9,0,9,8],[18,6,18,7],[26,5,26,6],[27,5,27,6],[31,5,31,6],[1,1,1,7],[32,2,32,3],[32,5,32,6],[22,2,22,3],[23,2,23,3],[24,2,24,3],[25,2,25,3],[26,2,26,3],[27,2,27,3],[28,2,28,3],[29,2,29,3],[30,2,30,3],[31,2,31,3],[5,6,5,7],[5,2,5,4]]}
[]
["Typ",{"$f":"Auslegung!$D$12","v":"MPC-R-M"},null,null,null,null,null,null,{"$f":"TODAY()","v":"2021-01-04"}]
["Projekt"]
[]
["Definition:"]
["Durchlass, Typ:",{"$f":"Auslegung!$D$12","v":"MPC-R-M"},"Nenndurchmesser:",null,null,{"$f":"Auslegung!$D$18","v":600},"Stutzen:",null,{"$f":"CONCATENATE(\"DN \",Auslegung!D25)","v":"DN 250"}]
["Schlitzanzahl:",{"$f":"Auslegung!D18","v":600},"Farbe Abdeckprofil:",null,{"$f":"Auslegung!B79","v":9010}]
["Innenauskleidung:",{"$f":"Auslegung!G93","v":"B1"},"Drossel fb:",null,{"$f":"Auslegung!B90","v":"ohne"}]
[]
["Beschreibung:\nMultifunktionaler Deckenluftdurchlass mit perforierter Frontplatte für den Deckeneinbau. Das Frontblech ist mit Schnellverschlüssen ausgestattet und zu Reinigungszwecken jederzeit abklappbar. Die Strahlausbreitung ist frei wählbar, es stehen eine quellluftartige (MPC-Q), eine radiale (MPC-R) und eine variable (MPC-V) luftlenkung zur Verfügung.\n"]
["Einsatzbereich"]
["Minimalvolumenstrom","V°min",{"$f":"Auslegung!K$42","v":200},"m³/h"]
["Maximalvolumenstrom","V°max",{"$f":"Auslegung!$K$43","v":450},"m³/h"]
[]
["technische Vorgaben",null,null,null,null,"Raumdaten"]
["Luftvolumenstrom Zuluft","V·SUP",{"$f":"Auslegung!D32","v":490},"m³/h",null,"Raumhöhe",{"$f":"Auslegung!D37","v":3},"m"]
["Temperatur Zuluft","tZUL",{"$f":"Auslegung!D34","v":18},"°C",null,"Raumbreite ",{"$f":"Auslegung!D40","v":10},"m"]
["Temperatur Raum","tRAUM",{"$f":"Auslegung!D35","v":26},"°C",null,"Raumlänge",{"$f":"Auslegung!D39","v":7},"m"]
[{"$f":"Auslegung!A41","v":"Abstand Durchlass zur nächstgelegenen Wand"},{"$f":"Auslegung!B41","v":"a"},{"$f":"Auslegung!D41","v":6},"m",null,"Nutzungsart",{"$f":"Auslegung!D45","v":"Konferenzraum"}]
[{"$f":"Auslegung!A42","v":"kleinster Abstand zwischen 2 Durchlässen"},"smin",{"$f":"Auslegung!D42","v":2},"m"]
[]
["technische Daten"]
[{"$f":"CONCATENATE(\"Druckverlust \",Auslegung!D70,\"durchlass\")","v":"Druckverlust Zuluftdurchlass"},"Dp_SUP/ETA",{"$f":"IF(Auslegung!$D$100=\"\",Auslegung!$E$100,Auslegung!$D$100)","v":36.74032733775487},null,"Pa"]
["kritischer Strahlweg","xkr.",{"$f":"Auslegung!D101","v":1.895397350899152},null,"m"]
[{"$f":"Auslegung!A105","v":"Geschwindigkeit im Fußbodenbereich in Wandnähe"},"vx1",{"$f":"Auslegung!D105","v":"< 0,1"},null,"m/s"]
[{"$f":"Auslegung!A106","v":"Zugluftrisiko am Fußboden**"},"DR1",{"$f":"Auslegung!$D$106","v":0},null,"%"]
[{"$f":"Auslegung!A107","v":"Geschwindigkeit im Aufenthaltsbereich*"},"vx2",{"$f":"Auslegung!$D$107","v":0.10289682405460553},null,"m/s"]
[{"$f":"Auslegung!A108","v":"Zugluftrisiko im Aufenthaltsbereich**"},"DR2",{"$f":"Auslegung!$D$108","v":6.8789311830925861},null,"%"]
[{"$f":"Auslegung!A109","v":"Geschwindigkeit nach Ablösen an Xkr."},"vx3",{"$f":"Auslegung!$D$109","v":"<0,1"},null,"m/s"]
[{"$f":"Auslegung!A110","v":"Zugluftrisiko nach Ablösepunkt**"},"DR3",{"$f":"Auslegung!$D$110","v":6.0440349022645217},null,"%"]
["Raumkategorie**","RAL",{"$f":"Auslegung!D111","v":"A"},null,{"$f":"\"-/-\"","v":"-/-"},"Maße"]
[{"$f":"Auslegung!$A$112","v":"Schallleistungspegel, Zuluftdurchlass"},"LWA_SUP/ETA",{"$f":"IF(Auslegung!$D$112=\"\",Auslegung!$E$112,Auslegung!$D$112)","v":41.581280489233833},null,"dB(A)",{"$f":"Auslegung!J39","v":"Breite Frontblende"},null,{"$f":"Auslegung!K39","v":595},"mm"]
[{"$f":"Auslegung!$A$114","v":"Schallldruckpegel in 5m Entfernung, Zuluftdurchlass"},"LPA_SUP",{"$f":"IF(Auslegung!$D$114=\"\",Auslegung!$E$114,Auslegung!$D$114)","v":34.054264326627745},null,"dB(A)",{"$f":"Auslegung!J40","v":"Höhe Anschlusskasten"},null,{"$f":"Auslegung!K40","v":300},"mm"]
[null,null,null,null,null,{"$f":"Auslegung!J40","v":"Höhe Anschlusskasten"},null,{"$f":"Auslegung!K40","v":300},"mm"]
[null,null,null,null,null,{"$f":"Auslegung!J41","v":"Durchmesser Anschlussstutzen"},null,{"$f":"Auslegung!K41","v":248},"mm"]
["*Gilt für Eintritt der Luftströmung in den Aufenthaltbereich nach dem Stoßpunkt"]
["** Raumkategorie nach DIN EN ISO 7730: DR<10 % = A; DR<20 % = B; DR<30 % = C"]
[]
[]
["Oktavspektrum Schallleistungspegel","f [Hz]",125,250,500,1000,2000,4000,8000]
[{"$f":"Auslegung!D70","v":"Zuluft"},"LWA_Okt",{"$f":"IF(Auslegung!$D$121=\"\",Auslegung!$E$121,Auslegung!$D$121)","v":43.306152444398307},{"$f":"IF(Auslegung!$D$122=\"\",Auslegung!$E$122,Auslegung!$D$122)","v":39.505519542826939},{"$f":"IF(Auslegung!$D$123=\"\",Auslegung!$E$123,Auslegung!$D$123)","v":39.097211623437737},{"$f":"IF(Auslegung!$D$124=\"\",Auslegung!$E$124,Auslegung!$D$124)","v":38.130825576990105},{"$f":"IF(Auslegung!$D$125=\"\",Auslegung!$E$125,Auslegung!$D$125)","v":31.187593454255936},{"$f":"IF(Auslegung!$D$126=\"\",Auslegung!$E$126,Auslegung!$D$126)","v":24.25700115341154},{"$f":"IF(Auslegung!$D$127=\"\",Auslegung!$E$127,Auslegung!$D$127)","v":23.555303026490385}]

{"sheet":"Grunddaten","index":4,"n_rows":142,"n_cols":23,"rows_kept":142,"cut":false,"hidden":true,"merged":[[0,9,0,10],[0,11,0,13],[0,14,0,15],[0,17,0,19],[0,20,0,21]]}
["Typ","Nenngröße",null,"Stutzendurchmesser","Variante","Widerstandsbeiwert","Durchmesser Anschluss","Anströmgeschwindigkeit","Druckverlust","CAP-Konstanten Geschwindigkeit",null,"CAP-Konstanten Xkrit.",null,null,"CAP-Konstanten ABLUFT",null,"Zeta-Abluft","Abmessungen",null,null,"Volumenstrom"]
[null,"DN",null,"dST","V","z","d","v","DpAnströmung","K031","K033","K041","K042","K043","K011","K012","z","Höhe AK","Breite","D Stutzen","Minimal","Maximal"]
[null,"mm",null,"mm",1,1,"mm","m/s","Pa",1,1,1,1,1,1,1,1,"mm","mm","mm","m³/h","m³/h"]
["MPC-R",300,{"$f":"CONCATENATE(A4,E4,B4,D4)","v":"MPC-R-S300100"},100,{"$f":"\"-S\"","v":"-S"},2.3057190516600459,null,{"$f":"Auslegung!$D$32/(PI()/4*(D4/1000)^2*3600)","v":17.330204914450825},{"$f":"F4*1.2/2*H4^2","v":415.49426554783952},1.0282169585881778E-3,1.1183503396115346,3.7401720299601983E-3,0.36592129170761201,1.3302653690784338,null,null,null,241,295,98,40,190]
["MPC-R",300,{"$f":"CONCATENATE(A5,E5,B5,D5)","v":"MPC-R-S300125"},125,{"$f":"\"-S\"","v":"-S"},3.527424979915343,null,{"$f":"Auslegung!$D$32/(PI()/4*(D5/1000)^2*3600)","v":11.091331145248528},260.36126936728385,1.0282169585881778E-3,1.1183503396115346,3.7401720299601983E-3,0.36592129170761201,1.3302653690784338,null,null,null,241,295,123,40,190]
["MPC-R",300,"MPC-R-S300160",160,{"$f":"\"-S\"","v":"-S"},4.8611995448070298,null,{"$f":"Auslegung!$D$32/(PI()/4*(D6/1000)^2*3600)","v":6.7696112947073539},133.66637311189575,1.0282169585881778E-3,1.1183503396115346,3.7401720299601983E-3,0.36592129170761201,1.3302653690784338,null,null,null,241,295,158,40,190]
["MPC-R",300,"MPC-R-S300225",225,{"$f":"\"-S\"","v":"-S"},null,null,{"$f":"Auslegung!$D$32/(PI()/4*(D7/1000)^2*3600)","v":3.4232503534717678},0,null,null,null,null,null,null,null,null,241,295,223,40,190]
["MPC-R",300,"MPC-R-S300250",250,{"$f":"\"-S\"","v":"-S"},null,null,{"$f":"Auslegung!$D$32/(PI()/4*(D8/1000)^2*3600)","v":2.772832786312132},0,null,null,null,null,null,null,null,null,241,295,248,40,190]
["MPC-R",300,"MPC-R-M300125",125,{"$f":"\"-M\"","v":"-M"},null,null,{"$f":"Auslegung!$D$32/(PI()/4*(D9/1000)^2*3600)","v":11.091331145248528},0,null,null,null,null,null,null,null,null,241,295,98]
["MPC-R",300,"MPC-R-M300160",160,{"$f":"\"-M\"","v":"-M"},null,null,{"$f":"Auslegung!$D$32/(PI()/4*(D10/1000)^2*3600)","v":6.7696112947073539},0,null,null,null,null,null,null,null,null,241,295,123]
["MPC-R",300,"MPC-R-M300200",200,{"$f":"\"-M\"","v":"-M"},null,null,{"$f":"Auslegung!$D$32/(PI()/4*(D11/1000)^2*3600)","v":4.3325512286127061},0,null,null,null,null,null,null,null,null,241,295,158]
["MPC-R",300,"MPC-R-M300225",225,{"$f":"\"-M\"","v":"-M"},null,null,{"$f":"Auslegung!$D$32/(PI()/4*(D12/1000)^2*3600)","v":3.4232503534717678},0,null,null,null,null,null,null,null,null,241,295,223]
["MPC-R",300,"MPC-R-M300250",250,{"$f":"\"-M\"","v":"-M"},null,null,{"$f":"Auslegung!$D$32/(PI()/4*(D13/1000)^2*3600)","v":2.772832786312132},0,null,null,null,null,null,null,null,null,241,295,248]
["MPC-R",300,"MPC-R-L300125",125,{"$f":"\"-L\"","v":"-L"},null,null,{"$f":"Auslegung!$D$32/(PI()/4*(D14/1000)^2*3600)","v":11.091331145248528},0,null,null,null,null,null,null,null,null,241,295,98]
["MPC-R",300,"MPC-R-L300160",160,{"$f":"\"-L\"","v":"-L"},null,null,{"$f":"Auslegung!$D$32/(PI()/4*(D15/1000)^2*3600)","v":6.7696112947073539},0,null,null,null,null,null,null,null,null,241,295,123]
["MPC-R",300,"MPC-R-L300200",200,{"$f":"\"-L\"","v":"-L"},null,null,{"$f":"Auslegung!$D$32/(PI()/4*(D16/1000)^2*3600)","v":4.3325512286127061},0,null,null,null,null,null,null,null,null,241,295,158]
["MPC-R",300,"MPC-R-L300225",225,{"$f":"\"-L\"","v":"-L"},null,null,{"$f":"Auslegung!$D$32/(PI()/4*(D17/1000)^2*3600)","v":3.4232503534717678},0,null,null,null,null,null,null,null,null,241,295,223]
["MPC-R",300,"MPC-R-L300250",250,{"$f":"\"-L\"","v":"-L"},null,null,{"$f":"Auslegung!$D$32/(PI()/4*(D18/1000)^2*3600)","v":2.772832786312132},0,null,null,null,null,null,null,null,null,241,295,248]
["MPC-V",300,"MPC-V300100",100,null,2.1980315022034036,null,{"$f":"Auslegung!$D$32/(PI()/4*(D19/1000)^2*3600)","v":17.330204914450825},396.0887966820988,null,null,null,null,null,null,null,null,241,295,98,40,160]
["MPC-V",300,"MPC-V300125",125,null,3.0234402272524497,null,{"$f":"Auslegung!$D$32/(PI()/4*(D20/1000)^2*3600)","v":11.091331145248528},223.16186450617278,null,null,null,null,null,null,null,null,241,295,123,40,160]
["MPC-V",300,"MPC-V300160",160,null,5.4604648656846875,null,{"$f":"Auslegung!$D$32/(PI()/4*(D21/1000)^2*3600)","v":6.7696112947073539},150.14412129629633,null,null,null,null,null,null,null,null,241,295,158,40,160]
["MPC-V",300,"MPC-V300225",225,null,null,null,{"$f":"Auslegung!$D$32/(PI()/4*(D22/1000)^2*3600)","v":3.4232503534717678},0,null,null,null,null,null,null,null,null,241,295,223,40,160]
["MPC-V",300,"MPC-V300250",250,null,null,null,{"$f":"Auslegung!$D$32/(PI()/4*(D23/1000)^2*3600)","v":2.772832786312132},0,null,null,null,null,null,null,null,null,241,295,248,40,160]
["MPC-Q",300,"MPC-Q300100",100,null,1.4992129666500644,null,{"$f":"Auslegung!$D$32/(PI()/4*(D24/1000)^2*3600)","v":17.330204914450825},270.16057746913577,null,null,null,null,null,8.0121760985875205E-4,2.0699562315137077,1.4992129666500644,241,295,98,40,350]
["MPC-Q",300,"MPC-Q300125",125,null,1.8129139620438781,null,{"$f":"Auslegung!$D$32/(PI()/4*(D25/1000)^2*3600)","v":11.091331145248528},133.81222367562418,null,null,null,null,null,3.1609498177504131E-4,2.106764031208205,1.8129139620438781,241,295,123,40,350]
["MPC-Q",300,"MPC-Q300160",160,null,2.9537622509712365,null,{"$f":"Auslegung!$D$32/(PI()/4*(D26/1000)^2*3600)","v":6.7696112947073539},81.218366677401448,null,null,null,null,null,3.0755153655497017E-5,2.4221155784433797,2.9537622509712365,241,295,158,40,350]
["MPC-Q",300,"MPC-Q300225",225,null,null,null,{"$f":"Auslegung!$D$32/(PI()/4*(D27/1000)^2*3600)","v":3.4232503534717678},0,null,null,null,null,null,null,null,null,241,295,223,40,350]
["MPC-Q",300,"MPC-Q300250",250,null,null,null,{"$f":"Auslegung!$D$32/(PI()/4*(D28/1000)^2*3600)","v":2.772832786312132},0,null,null,null,null,null,null,null,null,241,295,248,40,350]
["MPC-R",400,"MPC-R-S400125",125,{"$f":"\"-S\"","v":"-S"},null,null,{"$f":"Auslegung!$D$32/(PI()/4*(D29/1000)^2*3600)","v":11.091331145248528},0]
["MPC-R",400,"MPC-R-S400160",160,{"$f":"\"-S\"","v":"-S"},null,null,{"$f":"Auslegung!$D$32/(PI()/4*(D30/1000)^2*3600)","v":6.7696112947073539},0]
["MPC-R",400,"MPC-R-S400200",200,{"$f":"\"-S\"","v":"-S"},null,null,{"$f":"Auslegung!$D$32/(PI()/4*(D31/1000)^2*3600)","v":4.3325512286127061},0]
["MPC-R",400,"MPC-R-S400225",225,{"$f":"\"-S\"","v":"-S"},null,null,{"$f":"Auslegung!$D$32/(PI()/4*(D32/1000)^2*3600)","v":3.4232503534717678},0]
["MPC-R",400,"MPC-R-S400250",250,{"$f":"\"-S\"","v":"-S"},null,null,{"$f":"Auslegung!$D$32/(PI()/4*(D33/1000)^2*3600)","v":2.772832786312132},0]
["MPC-R",400,"MPC-R-M400125",125,{"$f":"\"-M\"","v":"-M"},null,null,{"$f":"Auslegung!$D$32/(PI()/4*(D34/1000)^2*3600)","v":11.091331145248528},0]
["MPC-R",400,"MPC-R-M400160",160,{"$f":"\"-M\"","v":"-M"},null,null,{"$f":"Auslegung!$D$32/(PI()/4*(D35/1000)^2*3600)","v":6.7696112947073539},0]
["MPC-R",400,"MPC-R-M400200",200,{"$f":"\"-M\"","v":"-M"},null,null,{"$f":"Auslegung!$D$32/(PI()/4*(D36/1000)^2*3600)","v":4.3325512286127061},{"$f":"F36*1.2/2*H36^2","v":0}]
["MPC-R",400,"MPC-R-M400225",225,{"$f":"\"-M\"","v":"-M"},null,null,{"$f":"Auslegung!$D$32/(PI()/4*(D37/1000)^2*3600)","v":3.4232503534717678},0]
["MPC-R",400,"MPC-R-M400250",250,{"$f":"\"-M\"","v":"-M"},null,null,{"$f":"Auslegung!$D$32/(PI()/4*(D38/1000)^2*3600)","v":2.772832786312132},0]
["MPC-R",400,"MPC-R-L400125",125,{"$f":"\"-L\"","v":"-L"},null,null,{"$f":"Auslegung!$D$32/(PI()/4*(D39/1000)^2*3600)","v":11.091331145248528},0]
["MPC-R",400,"MPC-R-L400160",160,{"$f":"\"-L\"","v":"-L"},null,null,{"$f":"Auslegung!$D$32/(PI()/4*(D40/1000)^2*3600)","v":6.7696112947073539},0]
["MPC-R",400,"MPC-R-L400200",200,{"$f":"\"-L\"","v":"-L"},null,null,{"$f":"Auslegung!$D$32/(PI()/4*(D41/1000)^2*3600)","v":4.3325512286127061},0]
["MPC-R",400,"MPC-R-L400225",225,{"$f":"\"-L\"","v":"-L"},null,null,{"$f":"Auslegung!$D$32/(PI()/4*(D42/1000)^2*3600)","v":3.4232503534717678},0]
["MPC-R",400,"MPC-R-L400250",250,{"$f":"\"-L\"","v":"-L"},null,null,{"$f":"Auslegung!$D$32/(PI()/4*(D43/1000)^2*3600)","v":2.772832786312132},0]
["MPC-V",400,"MPC-V400125",125,null,null,null,{"$f":"Auslegung!$D$32/(PI()/4*(D44/1000)^2*3600)","v":11.091331145248528},0]
["MPC-V",400,"MPC-V400160",160,null,null,null,{"$f":"Auslegung!$D$32/(PI()/4*(D45/1000)^2*3600)","v":6.7696112947073539},0]
["MPC-V",400,"MPC-V400200",200,null,null,null,{"$f":"Auslegung!$D$32/(PI()/4*(D46/1000)^2*3600)","v":4.3325512286127061},0]
["MPC-V",400,"MPC-V400225",225,null,null,null,{"$f":"Auslegung!$D$32/(PI()/4*(D47/1000)^2*3600)","v":3.4232503534717678},0]
["MPC-V",400,"MPC-V400250",250,null,null,null,{"$f":"Auslegung!$D$32/(PI()/4*(D48/1000)^2*3600)","v":2.772832786312132},0]
["MPC-Q",400,"MPC-Q400125",125,null,null,null,{"$f":"Auslegung!$D$32/(PI()/4*(D49/1000)^2*3600)","v":11.091331145248528},0]
["MPC-Q",400,"MPC-Q400160",160,null,null,null,{"$f":"Auslegung!$D$32/(PI()/4*(D50/1000)^2*3600)","v":6.7696112947073539},0]
["MPC-Q",400,"MPC-Q400200",200,null,null,null,{"$f":"Auslegung!$D$32/(PI()/4*(D51/1000)^2*3600)","v":4.3325512286127061},0]
["MPC-Q",400,"MPC-Q400225",225,null,null,null,{"$f":"Auslegung!$D$32/(PI()/4*(D52/1000)^2*3600)","v":3.4232503534717678},0]
["MPC-Q",400,"MPC-Q400250",250,null,null,null,{"$f":"Auslegung!$D$32/(PI()/4*(D53/1000)^2*3600)","v":2.772832786312132},0]
["MPC-R",500,"MPC-R-S500125",125,{"$f":"\"-S\"","v":"-S"},null,null,{"$f":"Auslegung!$D$32/(PI()/4*(D54/1000)^2*3600)","v":11.091331145248528},0]
["MPC-R",500,"MPC-R-S500160",160,{"$f":"\"-S\"","v":"-S"},null,null,{"$f":"Auslegung!$D$32/(PI()/4*(D55/1000)^2*3600)","v":6.7696112947073539},0]
["MPC-R",500,"MPC-R-S500200",200,{"$f":"\"-S\"","v":"-S"},null,null,{"$f":"Auslegung!$D$32/(PI()/4*(D56/1000)^2*3600)","v":4.3325512286127061},0]
["MPC-R",500,"MPC-R-S500225",225,{"$f":"\"-S\"","v":"-S"},null,null,{"$f":"Auslegung!$D$32/(PI()/4*(D57/1000)^2*3600)","v":3.4232503534717678},0]
["MPC-R",500,"MPC-R-S500250",250,{"$f":"\"-S\"","v":"-S"},null,null,{"$f":"Auslegung!$D$32/(PI()/4*(D58/1000)^2*3600)","v":2.772832786312132},0]
["MPC-R",500,"MPC-R-M500125",125,{"$f":"\"-M\"","v":"-M"},null,null,{"$f":"Auslegung!$D$32/(PI()/4*(D59/1000)^2*3600)","v":11.091331145248528},0]
["MPC-R",500,"MPC-R-M500160",160,{"$f":"\"-M\"","v":"-M"},null,null,{"$f":"Auslegung!$D$32/(PI()/4*(D60/1000)^2*3600)","v":6.7696112947073539},0]
["MPC-R",500,"MPC-R-M500200",200,{"$f":"\"-M\"","v":"-M"},null,null,{"$f":"Auslegung!$D$32/(PI()/4*(D61/1000)^2*3600)","v":4.3325512286127061},0]
["MPC-R",500,"MPC-R-M500225",225,{"$f":"\"-M\"","v":"-M"},null,null,{"$f":"Auslegung!$D$32/(PI()/4*(D62/1000)^2*3600)","v":3.4232503534717678},0]
["MPC-R",500,"MPC-R-M500250",250,{"$f":"\"-M\"","v":"-M"},null,null,{"$f":"Auslegung!$D$32/(PI()/4*(D63/1000)^2*3600)","v":2.772832786312132},0]
["MPC-R",500,"MPC-R-L500125",125,{"$f":"\"-L\"","v":"-L"},null,null,{"$f":"Auslegung!$D$32/(PI()/4*(D64/1000)^2*3600)","v":11.091331145248528},0]
["MPC-R",500,"MPC-R-L500160",160,{"$f":"\"-L\"","v":"-L"},null,null,{"$f":"Auslegung!$D$32/(PI()/4*(D65/1000)^2*3600)","v":6.7696112947073539},0]
["MPC-R",500,"MPC-R-L500200",200,{"$f":"\"-L\"","v":"-L"},null,null,{"$f":"Auslegung!$D$32/(PI()/4*(D66/1000)^2*3600)","v":4.3325512286127061},0]
["MPC-R",500,"MPC-R-L500225",225,{"$f":"\"-L\"","v":"-L"},null,null,{"$f":"Auslegung!$D$32/(PI()/4*(D67/1000)^2*3600)","v":3.4232503534717678},0]
["MPC-R",500,"MPC-R-L500250",250,{"$f":"\"-L\"","v":"-L"},null,null,{"$f":"Auslegung!$D$32/(PI()/4*(D68/1000)^2*3600)","v":2.772832786312132},{"$f":"F68*1.2/2*H68^2","v":0}]
["MPC-V",500,{"$f":"CONCATENATE(A69,E69,B69,D69)","v":"MPC-V500125"},125,null,null,null,{"$f":"Auslegung!$D$32/(PI()/4*(D69/1000)^2*3600)","v":11.091331145248528},0]
["MPC-V",500,"MPC-V500160",160,null,null,null,{"$f":"Auslegung!$D$32/(PI()/4*(D70/1000)^2*3600)","v":6.7696112947073539},0]
["MPC-V",500,"MPC-V500200",200,null,null,null,{"$f":"Auslegung!$D$32/(PI()/4*(D71/1000)^2*3600)","v":4.3325512286127061},0]
["MPC-V",500,"MPC-V500225",225,null,null,null,{"$f":"Auslegung!$D$32/(PI()/4*(D72/1000)^2*3600)","v":3.4232503534717678},0]
["MPC-V",500,"MPC-V500250",250,null,null,null,{"$f":"Auslegung!$D$32/(PI()/4*(D73/1000)^2*3600)","v":2.772832786312132},0]
["MPC-Q",500,"MPC-Q500125",125,null,null,null,{"$f":"Auslegung!$D$32/(PI()/4*(D74/1000)^2*3600)","v":11.091331145248528},0]
["MPC-Q",500,"MPC-Q500160",160,null,null,null,{"$f":"Auslegung!$D$32/(PI()/4*(D75/1000)^2*3600)","v":6.7696112947073539},0]
["MPC-Q",500,"MPC-Q500200",200,null,null,null,{"$f":"Auslegung!$D$32/(PI()/4*(D76/1000)^2*3600)","v":4.3325512286127061},0]
["MPC-Q",500,"MPC-Q500225",225,null,null,null,{"$f":"Auslegung!$D$32/(PI()/4*(D77/1000)^2*3600)","v":3.4232503534717678},0]
["MPC-Q",500,"MPC-Q500250",250,null,null,null,{"$f":"Auslegung!$D$32/(PI()/4*(D78/1000)^2*3600)","v":2.772832786312132},0]
["MPC-R",600,"MPC-R-S600125",125,{"$f":"\"-S\"","v":"-S"},2.1564576590741473,null,{"$f":"Auslegung!$D$32/(PI()/4*(D79/1000)^2*3600)","v":11.091331145248528},159.16938181540613,7.5962546009835112E-4,0.91097612304677467,6.1757049743381854E-4,0.3934951057384149,1.5101681178690047,null,null,null,300,595,123,100,350]
["MPC-R",600,"MPC-R-S600160",160,{"$f":"\"-S\"","v":"-S"},2.7100969965905071,null,{"$f":"Auslegung!$D$32/(PI()/4*(D80/1000)^2*3600)","v":6.7696112947073539},74.518404969132916,7.5962546009835112E-4,0.91097612304677467,6.1757049743381854E-4,0.3934951057384149,1.5101681178690047,null,null,null,300,595,158,100,350]
["MPC-R",600,"MPC-R-S600200",200,{"$f":"\"-S\"","v":"-S"},3.4989320986838854,null,{"$f":"Auslegung!$D$32/(PI()/4*(D81/1000)^2*3600)","v":4.3325512286127061},39.407072966504224,7.5962546009835112E-4,0.91097612304677467,6.1757049743381854E-4,0.3934951057384149,1.5101681178690047,null,null,null,300,595,198,100,350]
["MPC-R",600,"MPC-R-S600225",225,{"$f":"\"-S\"","v":"-S"},11.474858473370432,null,{"$f":"Auslegung!$D$32/(PI()/4*(D82/1000)^2*3600)","v":3.4232503534717678},80.681861834792798,7.5962546009835112E-4,0.91097612304677467,6.1757049743381854E-4,0.3934951057384149,1.5101681178690047,null,null,null,300,595,223,100,350]
["MPC-R",600,"MPC-R-S600250",250,{"$f":"\"-S\"","v":"-S"},11.474858473370432,null,{"$f":"Auslegung!$D$32/(PI()/4*(D83/1000)^2*3600)","v":2.772832786312132},52.935369549807554,7.5962546009835112E-4,0.91097612304677467,6.1757049743381854E-4,0.3934951057384149,1.5101681178690047,null,null,null,300,595,248,100,350]
["MPC-R",600,"MPC-R-M600125",125,{"$f":"\"-M\"","v":"-M"},2.0146586984801305,null,{"$f":"Auslegung!$D$32/(PI()/4*(D84/1000)^2*3600)","v":11.091331145248528},148.70311886568189,6.6062351377575983E-4,0.93653411518802254,6.6454867776380997E-5,0.47201071612740536,1.8145300481212068,null,null,null,300,595,123,200,450]
["MPC-R",600,"MPC-R-M600160",160,{"$f":"\"-M\"","v":"-M"},2.0485109297181539,null,{"$f":"Auslegung!$D$32/(PI()/4*(D85/1000)^2*3600)","v":6.7696112947073539},56.327049266679019,6.6062351377575983E-4,0.93653411518802254,6.6454867776380997E-5,0.47201071612740536,1.8145300481212068,null,null,null,300,595,158,200,450]
["MPC-R",600,"MPC-R-M600200",200,{"$f":"\"-M\"","v":"-M"},3.4745936517220066,null,{"$f":"Auslegung!$D$32/(PI()/4*(D86/1000)^2*3600)","v":4.3325512286127061},39.13295877158204,6.6062351377575983E-4,0.93653411518802254,6.6454867776380997E-5,0.47201071612740536,1.8145300481212068,null,null,null,300,595,198,200,450]
["MPC-R",600,"MPC-R-M600225",225,{"$f":"\"-M\"","v":"-M"},7.9642413012600271,null,{"$f":"Auslegung!$D$32/(PI()/4*(D87/1000)^2*3600)","v":3.4232503534717678},55.998060261781539,6.6062351377575983E-4,0.93653411518802254,6.6454867776380997E-5,0.47201071612740536,1.8145300481212068,null,null,null,300,595,223,200,450]
["MPC-R",600,"MPC-R-M600250",250,{"$f":"\"-M\"","v":"-M"},7.9642413012600271,null,{"$f":"Auslegung!$D$32/(PI()/4*(D88/1000)^2*3600)","v":2.772832786312132},36.74032733775487,6.6062351377575983E-4,0.93653411518802254,6.6454867776380997E-5,0.47201071612740536,1.8145300481212068,null,null,null,300,595,248,200,450]
["MPC-R",600,"MPC-R-L600125",125,{"$f":"\"-L\"","v":"-L"},1.8991312844420083,null,{"$f":"Auslegung!$D$32/(PI()/4*(D89/1000)^2*3600)","v":11.091331145248528},140.17597389819142,8.6880844411266959E-4,1.1281074762288941,5.3482189975033198E-6,0.43362090077088772,2.1944683937858946,null,null,null,300,595,123,300,550]
["MPC-R",600,"MPC-R-L600160",160,{"$f":"\"-L\"","v":"-L"},2.0728751730033781,null,{"$f":"Auslegung!$D$32/(PI()/4*(D90/1000)^2*3600)","v":6.7696112947073539},56.996982686102363,8.6880844411266959E-4,1.1281074762288941,5.3482189975033198E-6,0.43362090077088772,2.1944683937858946,null,null,null,300,595,158,300,550]
["MPC-R",600,"MPC-R-L600200",200,{"$f":"\"-L\"","v":"-L"},3.4539367274314103,null,{"$f":"Auslegung!$D$32/(PI()/4*(D91/1000)^2*3600)","v":4.3325512286127061},38.900308094225572,8.6880844411266959E-4,1.1281074762288941,5.3482189975033198E-6,0.43362090077088772,2.1944683937858946,null,null,null,300,595,198,300,550]
["MPC-R",600,"MPC-R-L600225",225,{"$f":"\"-L\"","v":"-L"},5.3952029712764835,null,{"$f":"Auslegung!$D$32/(PI()/4*(D92/1000)^2*3600)","v":3.4232503534717678},37.93467446325171,8.6880844411266959E-4,1.1281074762288941,5.3482189975033198E-6,0.43362090077088772,2.1944683937858946,null,null,null,300,595,223,300,550]
["MPC-R",600,"MPC-R-L600250",250,{"$f":"\"-L\"","v":"-L"},5.3952029712764835,null,{"$f":"Auslegung!$D$32/(PI()/4*(D93/1000)^2*3600)","v":2.772832786312132},24.888939915339446,8.6880844411266959E-4,1.1281074762288941,5.3482189975033198E-6,0.43362090077088772,2.1944683937858946,null,null,null,300,595,248,300,550]
["MPC-V",600,"MPC-V600125",125,null,1.7921969823245274,null,{"$f":"Auslegung!$D$32/(PI()/4*(D94/1000)^2*3600)","v":11.091331145248528},132.2830914707159,null,null,null,null,null,null,null,null,300,595,123,200,450]
["MPC-V",600,"MPC-V600160",160,null,2.0030457495143641,null,{"$f":"Auslegung!$D$32/(PI()/4*(D95/1000)^2*3600)","v":6.7696112947073539},55.076912199746381,null,null,null,null,null,null,null,null,300,595,158,200,450]
["MPC-V",600,"MPC-V600200",200,null,3.4745936517220066,null,{"$f":"Auslegung!$D$32/(PI()/4*(D96/1000)^2*3600)","v":4.3325512286127061},39.13295877158204,null,null,null,null,null,null,null,null,300,595,198,200,450]
["MPC-V",600,"MPC-V600225",225,null,5.8505059535732729,null,{"$f":"Auslegung!$D$32/(PI()/4*(D97/1000)^2*3600)","v":3.4232503534717678},41.135994322306047,null,null,null,null,null,null,null,null,300,595,223,200,450]
["MPC-V",600,"MPC-V600250",250,null,5.8505059535732729,null,{"$f":"Auslegung!$D$32/(PI()/4*(D98/1000)^2*3600)","v":2.772832786312132},26.989325874864996,null,null,null,null,null,null,null,null,300,595,248,200,450]
["MPC-Q",600,"MPC-Q600125",125,null,1.5702839934673622,null,{"$f":"Auslegung!$D$32/(PI()/4*(D99/1000)^2*3600)","v":11.091331145248528},115.90356595368391,null,null,null,null,null,5.7461675813817779E-4,1.9692465824233614,1.5702839934673622,300,595,123,200,700]
["MPC-Q",600,"MPC-Q600160",160,null,1.4147324835559052,null,{"$f":"Auslegung!$D$32/(PI()/4*(D100/1000)^2*3600)","v":6.7696112947073539},{"$f":"F100*1.2/2*H100^2","v":38.900308094225565},null,null,null,null,null,2.0752919450988717E-4,1.9582675091983304,1.4147324835559052,300,595,158,200,700]
["MPC-Q",600,"MPC-Q600200",200,null,3.3963187547253844,null,{"$f":"Auslegung!$D$32/(PI()/4*(D101/1000)^2*3600)","v":4.3325512286127061},38.251379909691067,null,null,null,null,null,2.0804802792036192E-4,1.9580342897154526,3.3963187547253844,300,595,198,200,700]
["MPC-Q",600,"MPC-Q600225",225,null,2.5821417964125692,null,{"$f":"Auslegung!$D$32/(PI()/4*(D102/1000)^2*3600)","v":3.4232503534717678},18.155518705479132,null,null,null,null,null,7.4224599066404339E-5,1.9381232681377221,2.5821417964125692,300,595,223,200,700]
["MPC-Q",600,"MPC-Q600250",250,null,2.5821417964125692,null,{"$f":"Auslegung!$D$32/(PI()/4*(D103/1000)^2*3600)","v":2.772832786312132},11.911835822664859,null,null,null,null,null,7.4224599066404339E-5,1.9381232681377221,2.5821417964125692,300,595,248,200,700]
["MPC-R",625,"MPC-R-S625125",125,{"$f":"\"-S\"","v":"-S"},2.1564576590741473,null,{"$f":"Auslegung!$D$32/(PI()/4*(D104/1000)^2*3600)","v":11.091331145248528},159.16938181540613,7.5962546009835112E-4,0.91097612304677467,6.1757049743381854E-4,0.3934951057384149,1.5101681178690047,null,null,null,300,620,123,100,350]
["MPC-R",625,"MPC-R-S625160",160,{"$f":"\"-S\"","v":"-S"},2.7100969965905071,null,{"$f":"Auslegung!$D$32/(PI()/4*(D105/1000)^2*3600)","v":6.7696112947073539},74.518404969132916,7.5962546009835112E-4,0.91097612304677467,6.1757049743381854E-4,0.3934951057384149,1.5101681178690047,null,null,null,300,620,158,100,350]
["MPC-R",625,"MPC-R-S625200",200,{"$f":"\"-S\"","v":"-S"},3.4989320986838854,null,{"$f":"Auslegung!$D$32/(PI()/4*(D106/1000)^2*3600)","v":4.3325512286127061},39.407072966504224,7.5962546009835112E-4,0.91097612304677467,6.1757049743381854E-4,0.3934951057384149,1.5101681178690047,null,null,null,300,620,198,100,350]
["MPC-R",625,"MPC-R-S625225",225,{"$f":"\"-S\"","v":"-S"},11.474858473370432,null,{"$f":"Auslegung!$D$32/(PI()/4*(D107/1000)^2*3600)","v":3.4232503534717678},80.681861834792798,7.5962546009835112E-4,0.91097612304677467,6.1757049743381854E-4,0.3934951057384149,1.5101681178690047,null,null,null,300,620,223,100,350]
["MPC-R",625,"MPC-R-S625250",250,{"$f":"\"-S\"","v":"-S"},11.474858473370432,null,{"$f":"Auslegung!$D$32/(PI()/4*(D108/1000)^2*3600)","v":2.772832786312132},52.935369549807554,7.5962546009835112E-4,0.91097612304677467,6.1757049743381854E-4,0.3934951057384149,1.5101681178690047,null,null,null,300,620,248,100,350]
["MPC-R",625,"MPC-R-M625125",125,{"$f":"\"-M\"","v":"-M"},2.0146586984801305,null,{"$f":"Auslegung!$D$32/(PI()/4*(D109/1000)^2*3600)","v":11.091331145248528},148.70311886568189,6.6062351377575983E-4,0.93653411518802254,6.6454867776380997E-5,0.47201071612740536,1.8145300481212068,null,null,null,300,620,123,200,450]
["MPC-R",625,"MPC-R-M625160",160,{"$f":"\"-M\"","v":"-M"},2.0485109297181539,null,{"$f":"Auslegung!$D$32/(PI()/4*(D110/1000)^2*3600)","v":6.7696112947073539},56.327049266679019,6.6062351377575983E-4,0.93653411518802254,6.6454867776380997E-5,0.47201071612740536,1.8145300481212068,null,null,null,300,620,158,200,450]
["MPC-R",625,"MPC-R-M625200",200,{"$f":"\"-M\"","v":"-M"},3.4745936517220066,null,{"$f":"Auslegung!$D$32/(PI()/4*(D111/1000)^2*3600)","v":4.3325512286127061},39.13295877158204,6.6062351377575983E-4,0.93653411518802254,6.6454867776380997E-5,0.47201071612740536,1.8145300481212068,null,null,null,300,620,198,200,450]
["MPC-R",625,"MPC-R-M625225",225,{"$f":"\"-M\"","v":"-M"},7.9642413012600271,null,{"$f":"Auslegung!$D$32/(PI()/4*(D112/1000)^2*3600)","v":3.4232503534717678},55.998060261781539,6.6062351377575983E-4,0.93653411518802254,6.6454867776380997E-5,0.47201071612740536,1.8145300481212068,null,null,null,300,620,223,200,450]
["MPC-R",625,"MPC-R-M625250",250,{"$f":"\"-M\"","v":"-M"},7.9642413012600271,null,{"$f":"Auslegung!$D$32/(PI()/4*(D113/1000)^2*3600)","v":2.772832786312132},36.74032733775487,6.6062351377575983E-4,0.93653411518802254,6.6454867776380997E-5,0.47201071612740536,1.8145300481212068,null,null,null,300,620,248,200,450]
["MPC-R",625,"MPC-R-L625125",125,{"$f":"\"-L\"","v":"-L"},1.8991312844420083,null,{"$f":"Auslegung!$D$32/(PI()/4*(D114/1000)^2*3600)","v":11.091331145248528},140.17597389819142,8.6880844411266959E-4,1.1281074762288941,5.3482189975033198E-6,0.43362090077088772,2.1944683937858946,null,null,null,300,620,123,300,550]
["MPC-R",625,"MPC-R-L625160",160,{"$f":"\"-L\"","v":"-L"},2.0728751730033781,null,{"$f":"Auslegung!$D$32/(PI()/4*(D115/1000)^2*3600)","v":6.7696112947073539},56.996982686102363,8.6880844411266959E-4,1.1281074762288941,5.3482189975033198E-6,0.43362090077088772,2.1944683937858946,null,null,null,300,620,158,300,550]
["MPC-R",625,"MPC-R-L625200",200,{"$f":"\"-L\"","v":"-L"},3.4539367274314103,null,{"$f":"Auslegung!$D$32/(PI()/4*(D116/1000)^2*3600)","v":4.3325512286127061},38.900308094225572,8.6880844411266959E-4,1.1281074762288941,5.3482189975033198E-6,0.43362090077088772,2.1944683937858946,null,null,null,300,620,198,300,550]
["MPC-R",625,"MPC-R-L625225",225,{"$f":"\"-L\"","v":"-L"},5.3952029712764835,null,{"$f":"Auslegung!$D$32/(PI()/4*(D117/1000)^2*3600)","v":3.4232503534717678},37.93467446325171,8.6880844411266959E-4,1.1281074762288941,5.3482189975033198E-6,0.43362090077088772,2.1944683937858946,null,null,null,300,620,223,300,550]
["MPC-R",625,"MPC-R-L625250",250,{"$f":"\"-L\"","v":"-L"},5.3952029712764835,null,{"$f":"Auslegung!$D$32/(PI()/4*(D118/1000)^2*3600)","v":2.772832786312132},24.888939915339446,8.6880844411266959E-4,1.1281074762288941,5.3482189975033198E-6,0.43362090077088772,2.1944683937858946,null,null,null,300,620,248,300,550]
["MPC-V",625,"MPC-V625125",125,null,1.7921969823245274,null,{"$f":"Auslegung!$D$32/(PI()/4*(D119/1000)^2*3600)","v":11.091331145248528},132.2830914707159,null,null,null,null,null,null,null,null,300,620,123,200,450]
["MPC-V",625,"MPC-V625160",160,null,2.0030457495143641,null,{"$f":"Auslegung!$D$32/(PI()/4*(D120/1000)^2*3600)","v":6.7696112947073539},55.076912199746381,null,null,null,null,null,null,null,null,300,620,158,200,450]
["MPC-V",625,"MPC-V625200",200,null,3.4745936517220066,null,{"$f":"Auslegung!$D$32/(PI()/4*(D121/1000)^2*3600)","v":4.3325512286127061},39.13295877158204,null,null,null,null,null,null,null,null,300,620,198,200,450]
["MPC-V",625,"MPC-V625225",225,null,5.8505059535732729,null,{"$f":"Auslegung!$D$32/(PI()/4*(D122/1000)^2*3600)","v":3.4232503534717678},41.135994322306047,null,null,null,null,null,null,null,null,300,620,223,200,450]
["MPC-V",625,"MPC-V625250",250,null,5.8505059535732729,null,{"$f":"Auslegung!$D$32/(PI()/4*(D123/1000)^2*3600)","v":2.772832786312132},26.989325874864996,null,null,null,null,null,null,null,null,300,620,248,200,450]
["MPC-Q",625,"MPC-Q625125",125,null,1.5702839934673622,null,{"$f":"Auslegung!$D$32/(PI()/4*(D124/1000)^2*3600)","v":11.091331145248528},115.90356595368391,null,null,null,null,null,5.7461675813817779E-4,1.9692465824233614,1.5702839934673622,300,620,123,200,700]
["MPC-Q",625,"MPC-Q625160",160,null,1.4147324835559052,null,{"$f":"Auslegung!$D$32/(PI()/4*(D125/1000)^2*3600)","v":6.7696112947073539},38.900308094225565,null,null,null,null,null,2.0752919450988717E-4,1.9582675091983304,1.4147324835559052,300,620,158,200,700]
["MPC-Q",625,"MPC-Q625200",200,null,3.3963187547253844,null,{"$f":"Auslegung!$D$32/(PI()/4*(D126/1000)^2*3600)","v":4.3325512286127061},38.251379909691067,null,null,null,null,null,2.0804802792036192E-4,1.9580342897154526,3.3963187547253844,300,620,198,200,700]
["MPC-Q",625,"MPC-Q625225",225,null,2.5821417964125692,null,{"$f":"Auslegung!$D$32/(PI()/4*(D127/1000)^2*3600)","v":3.4232503534717678},18.155518705479132,null,null,null,null,null,7.4224599066404339E-5,1.9381232681377221,2.5821417964125692,300,620,223,200,700]
["MPC-Q",625,"MPC-Q625250",250,null,2.5821417964125692,null,{"$f":"Auslegung!$D$32/(PI()/4*(D128/1000)^2*3600)","v":2.772832786312132},11.911835822664859,null,null,null,null,null,7.4224599066404339E-5,1.9381232681377221,2.5821417964125692,300,620,248,200,700]
[]
["Spaltenindex",1,1,2,3,4,5,6,7,8,9,10,11,12,13,14,15,16,17,18,19,20,21]
[]
[]
["GRÜN hinterlegte Zellen:",null,"Ausgleichsrechnung beruhend auf Messungen"]
["GELB hinterlegte Zellen:",null,"Werte beruhen auf Anschauung"]
["DURCHGESTRICHENE Zellen:",null,"Durchlass nicht geplant oder nicht vorhanden"]
["Stand:","2020-10-30"]
[]
[null,"Übergabe:","Volumenstrom für Druckverlustberechnung",null,null,{"$f":"Auslegung!$D$32","v":490}]
[null,null,"\"Pfuschzelle\" für Auswahl DN 625:",null,null,{"$f":"Auslegung!D18","v":600}]
[]
["Auswahl:","Zuluft",{"$f":"CONCATENATE(Auslegung!$D$12,$F$139,Auslegung!$D$25)","v":"MPC-R-M600250"},{"$f":"VLOOKUP($C$141,$C$4:$I$128,D130,FALSE)","v":250},{"$f":"VLOOKUP($C$141,$C$4:$I$128,E130,FALSE)","v":"-M"},{"$f":"VLOOKUP($C$141,$C$4:$Q$128,F130,FALSE)","v":7.9642413012600271},{"$f":"VLOOKUP($C$141,$C$4:$Q$128,G130,FALSE)","v":0},{"$f":"VLOOKUP($C$141,$C$4:$Q$128,H130,FALSE)","v":2.772832786312132},36.74032733775487,{"$f":"VLOOKUP($C$141,$C$4:$W$128,J130,FALSE)","v":6.6062351377575983E-4},{"$f":"VLOOKUP($C$141,$C$4:$W$128,K130,FALSE)","v":0.93653411518802254},6.6454867776380997E-5,0.47201071612740536,1.8145300481212068,0,0,0,300,595,248,{"$f":"VLOOKUP($C$141,$C$4:$W$128,U130,FALSE)","v":200},450,0]
[null,"Abluft",{"$f":"CONCATENATE(\"MPC-Q\",$F$139,Auslegung!$D$25)","v":"MPC-Q600250"},{"$f":"VLOOKUP($C$142,$C$4:$I$128,2,FALSE)","v":250},{"$f":"VLOOKUP($C$142,$C$4:$I$128,E130,FALSE)","v":0},{"$f":"VLOOKUP($C$142,$C$4:$I$128,F130,FALSE)","v":2.5821417964125692},{"$f":"VLOOKUP($C$142,$C$4:$I$128,G130,FALSE)","v":0},{"$f":"VLOOKUP($C$142,$C$4:$I$128,H130,FALSE)","v":2.772832786312132},11.911835822664859,{"$f":"VLOOKUP($C$142,$C$4:$W$128,J130,FALSE)","v":0},{"$f":"VLOOKUP($C$142,$C$4:$W$128,K130,FALSE)","v":0},0,0,0,7.4224599066404339E-5,1.9381232681377221,2.5821417964125692,300,595,248,200,700,0]

{"sheet":"Lw","index":5,"n_rows":597,"n_cols":26,"rows_kept":597,"cut":false,"hidden":true,"merged":[[1,3,1,23],[519,12,519,18],[505,3,505,23],[518,3,518,9],[524,3,524,23],[571,0,571,4],[572,0,572,3],[573,0,573,3],[574,0,574,3],[575,0,575,3],[576,0,576,3],[577,0,577,3],[578,0,578,3],[579,0,579,3],[580,0,580,3],[581,0,581,3],[582,0,582,3],[583,0,583,3],[584,0,584,3],[585,0,585,3],[586,0,586,3],[587,0,587,3],[593,0,593,3],[594,0,594,3],[595,0,595,3],[596,0,596,3],[588,0,588,3],[589,0,589,3],[590,0,590,3],[591,0,591,3],[592,0,592,3]]}
[]
[null,null,null,"Terzfrequenzband fm [Hz]"]
[null,null,null,100,125,160,200,250,315,400,500,630,800,1000,1250,1600,2000,2500,3150,4000,5000,6300,8000,10000]
["MPC-Q300100","k1",{"$f":"CONCATENATE(A4,B4)","v":"MPC-Q300100k1"},-22.733605483227361,-18.30484424581012,-20.545982744044842,-25.271824217000912,-33.267051115204573,-31.075075206084623,-30.807280627212496,-29.89614113710584,-33.249553936113912,-33.002880969661803,-36.825774559570135,-41.410042426583317,-45.475524146369821,-48.264812740264752,-47.544868234426538,-45.866062947866901,-39.641923784929098,-27.235313069628049,-13.858525221165721,-3.0306675402640297,4.5298747180445513]
["MPC-Q300100","k2","MPC-Q300100k2",4.1494530953610154,4.9643867221935745,4.9366833346446857,5.3533490029250386,7.9531402580699506,7.8723230357426504,6.8739621555953194,6.1722700814987554,5.9140589544840623,7.9810412990962547,8.2762801302338165,7.9553528139491494,7.8021079669896638,7.473998867774772,7.2856680043297093,7.1594453916972567,6.7722139908537313,6.2971546372006566,5.9760539679168883,5.7917418101481921,5.8641134270404587,"Messdatum:","2012-10-02"]
["MPC-Q300100","k3","MPC-Q300100k3",38.597129727507088,32.984474273211298,36.20950847930547,43.485292516543382,57.689974889064892,54.427739554054895,53.040415960052343,51.016106022631774,55.624905221519349,57.334471297246829,63.178274401921996,69.510770402617581,75.258052327415811,78.978178234763675,77.744871697502674,75.182018395724882,65.761077105516108,47.27914991122438,27.54314164033017,11.643442584295762,0.74253477866450246]
["MPC-Q300100","k4","MPC-Q300100k4",-3.1738212130560504,-2.394962899867755,-2.7890958169443505,-3.6201905085852268,-5.0262346057611165,-4.6407485566619693,-4.5936597370705448,-4.4334294911007319,-5.0231706560335816,-4.9797763806023854,-5.6520783010271352,-6.458280151303704,-7.1732478231890502,-7.663781764597819,-7.5371711732743432,-7.2419316987935707,-6.1473425208581514,-3.9654884449839489,-1.6130172872707833,0.29119382251796944,1.6208176607412372]
["MPC-Q300125","k1","MPC-Q300125k1",-5.2213213475038147,-10.471481409865367,-15.615878705237201,-20.788806442380096,-21.604170528421637,-23.570381818582518,-26.633613672352574,-29.220486325110823,-31.845945993949304,-32.104770270720316,-35.228266835552709,-37.191904242901295,-39.160704187197332,-39.52032457542272,-38.579920546409284,-35.692420703051354,-29.883794301978398,-19.956420404565662,-8.8491631894368368,-0.22540008384142343,5.175974984210665]
["MPC-Q300125","k2","MPC-Q300125k2",3.4797272836863176,4.0184940102215645,4.1283121759862045,4.3869088606244997,6.7304384584258736,7.1335674354459373,6.2962227999421341,5.6678411271123288,5.5696191673491118,6.9085472506546708,7.0468668430514061,6.7824741841692271,6.6673311108828139,6.3043754246751691,6.2495697351139636,6.0889605865982261,5.8417947329882791,5.5436485443066461,5.3892267761001902,5.3852914129952758,5.5925390204185623,"Messdatum:","2012-10-02"]
["MPC-Q300125","k3","MPC-Q300125k3",13.715951729951044,22.892457086232255,31.465904125033504,40.235112146425308,43.920693755223645,47.558749689571265,51.76083830734504,55.388244300731643,59.609435092749742,61.374515790369898,66.651676896294461,69.617809094652628,72.741736097610826,72.970341476945265,71.368345543405511,66.457160964712827,56.653524231423873,40.02270098058996,21.594510235068412,7.4027171016896531,-1.276446482836473]
["MPC-Q300125","k4","MPC-Q300125k4",-0.60741659850558583,-1.9639290352030692,-3.2931182148754514,-4.6296789908491318,-4.8403335464560397,-5.3483526674481814,-6.1398241275834158,-6.8082157621065473,-7.4865732878248386,-7.5534377380009197,-8.3604740937902555,-8.867832953690904,-9.3765274810106316,-9.4694469727912658,-9.2264678640488373,-8.4804078938736769,-6.9795981474288888,-4.4146016366069878,-1.5447525173889955,0.68341887706410775,2.0790177629206048]
["MPC-Q300160","k1","MPC-Q300160k1",-12.014276495777725,-11.449424404380702,-13.882622573811705,-19.055075186398383,-20.571866592869991,-23.050051700507137,-25.070873999629615,-25.572192169822056,-24.293235671424952,-27.685697342566954,-30.461943222093392,-32.303091823253169,-34.353448196010518,-34.919480526757518,-34.763786774227938,-32.353483562225634,-26.784003330758303,-18.7581557761774,-9.8821920180292544,-1.9581243450305066,3.4329182255383204]
["MPC-Q300160","k2","MPC-Q300160k2",3.6653948865344534,4.2928373835198865,4.4409878777158553,4.9843979644359271,6.8501384876918552,6.497060063304823,6.6435983962655474,6.2383482443717115,6.2057500446038247,7.0492262045640324,7.5123772319646136,7.4818117232553289,7.3861841296889921,7.2521854124253471,7.1630350430444256,6.9451936210188174,6.5160879132102894,6.0226881155840113,5.5919786104792326,5.258430365866448,5.1904641372907969,"Messdatum:","2012-10-04"]
["MPC-Q300160","k3","MPC-Q300160k3",27.867940234161438,27.445140756347932,32.118155452182471,42.280514171529198,46.967407582308141,51.222723407372904,55.127269152508291,55.654168400540328,53.243185675002032,60.395586610164862,66.021623609112382,69.414884286554738,73.132130561460031,74.050697805701574,73.67199290195893,68.971846473253436,58.185490034077183,42.766923028715944,25.830191431945341,10.760856590522442,0.66753760313501997]
["MPC-Q300160","k4","MPC-Q300160k4",-5.1215501988812973,-4.8558524037420936,-6.000365344812141,-8.4333517066500931,-9.1467943123154551,-10.312473873265615,-11.263017671474643,-11.498828119083344,-10.897238912965332,-12.492961148672951,-13.798833376957209,-14.664860668784494,-15.629300184778229,-15.895546762718649,-15.822314768260441,-14.688572979713118,-12.068829881001991,-8.2936785963338089,-4.1186556382443467,-0.39138368514778821,2.1444329131584601]
["MPC-Q400125","k1","MPC-Q400125k1"]
["MPC-Q400126","k2","MPC-Q400126k2"]
["MPC-Q400127","k3","MPC-Q400127k3"]
["MPC-Q400128","k4","MPC-Q400128k4"]
["MPC-Q400160","k1","MPC-Q400160k1"]
["MPC-Q400160","k2","MPC-Q400160k2"]
["MPC-Q400160","k3","MPC-Q400160k3"]
["MPC-Q400160","k4","MPC-Q400160k4"]
["MPC-Q400200","k1","MPC-Q400200k1"]
["MPC-Q400200","k2","MPC-Q400200k2"]
["MPC-Q400200","k3","MPC-Q400200k3"]
["MPC-Q400200","k4","MPC-Q400200k4"]
["MPC-Q400225","k1","MPC-Q400225k1"]
["MPC-Q400225","k2","MPC-Q400225k2"]
["MPC-Q400225","k3","MPC-Q400225k3"]
["MPC-Q400225","k4","MPC-Q400225k4"]
["MPC-Q400250","k1","MPC-Q400250k1"]
["MPC-Q400250","k2","MPC-Q400250k2"]
["MPC-Q400250","k3","MPC-Q400250k3"]
["MPC-Q400250","k4","MPC-Q400250k4"]
["MPC-Q500125","k1","MPC-Q500125k1"]
["MPC-Q500125","k2","MPC-Q500125k2"]
["MPC-Q500125","k3","MPC-Q500125k3"]
["MPC-Q500125","k4","MPC-Q500125k4"]
["MPC-Q500160","k1","MPC-Q500160k1"]
["MPC-Q500160","k2","MPC-Q500160k2"]
["MPC-Q500160","k3","MPC-Q500160k3"]
["MPC-Q500160","k4","MPC-Q500160k4"]
["MPC-Q500200","k1","MPC-Q500200k1"]
["MPC-Q500201","k2","MPC-Q500201k2"]
["MPC-Q500202","k3","MPC-Q500202k3"]
["MPC-Q500203","k4","MPC-Q500203k4"]
["MPC-Q500225","k1","MPC-Q500225k1"]
["MPC-Q500225","k2","MPC-Q500225k2"]
["MPC-Q500225","k3","MPC-Q500225k3"]
["MPC-Q500225","k4","MPC-Q500225k4"]
["MPC-Q500250","k1","MPC-Q500250k1"]
["MPC-Q500250","k2","MPC-Q500250k2"]
["MPC-Q500250","k3","MPC-Q500250k3"]
["MPC-Q500250","k4","MPC-Q500250k4"]
["MPC-Q600125","k1","MPC-Q600125k1",-18.459900457105789,-26.345975505729161,-30.385940016098996,-23.000355931269262,-26.200804321478664,-30.385140108031766,-29.337922505476218,-29.901570044435005,-30.081000592897528,-27.095740017290229,-28.363212919414138,-30.842641115450263,-34.435534973941408,-39.19642324672197,-43.886529636656334,-46.655229500712522,-46.207501908290126,-40.568431722018957,-31.397526416956914,-21.354947639818178,-10.473151605972692]
["MPC-Q600125","k2","MPC-Q600125k2",2.7518802385308998,2.9075860826993063,3.900632876841386,4.9319697008091472,3.9015356016445124,2.9744630618878349,4.5786187443367572,4.0129729968250345,4.2291557136177813,5.0351280200506361,5.1593363841740301,4.9800907957101481,4.8086950636180896,4.2618641892572899,3.611941073156355,3.0449303741655043,2.7244021980283066,2.664426519201577,3.11633885303638,3.6908478064277626,4.516661716276019,"Messdatum:","2012-10-05"]
["MPC-Q600125","k3","MPC-Q600125k3",34.768948905303041,47.899214180261282,55.539304460849095,44.41988093479609,48.654635356246807,54.611536104850387,54.49325589260868,54.854770963848345,55.366228985803865,51.260975823569481,53.470522271636241,57.370473489744512,63.110217930167828,70.396040074942022,77.462305703462576,81.450312431303459,80.393049218073912,71.055406084956317,56.419075069815484,40.471268625072511,23.39418481376509]
["MPC-Q600125","k4","MPC-Q600125k4",-2.8136807911046327,-4.3591726521171541,-5.1509085303371416,-3.7034923340977195,-4.3307158290729122,-5.1507583823815022,-4.94551572913978,-5.0559818195473145,-5.0911442421996238,-4.5060949940740169,-4.7544899980542921,-5.240402532900637,-5.944530358543763,-6.8775619219489661,-7.7967230689562577,-8.339329480880691,-8.2515852339350548,-7.1464555995473598,-5.3491614575186315,-3.3810382480645553,-1.2484475434210218]
["MPC-Q600160","k1","MPC-Q600160k1",-13.017200001997832,-12.310903891526399,-20.51795900602534,-21.624770100663923,-25.250242021073991,-28.641624579672314,-27.603087099008778,-27.042022377419489,-27.40322033570229,-27.287699737511822,-29.844614004696751,-34.043727262716402,-39.433062071119984,-44.51681972611366,-48.12869218058453,-46.980946657856968,-39.920217227474183,-26.800008795785985,-14.888385370487974,-4.3818938204718663,2.9754582752469068]
["MPC-Q600160","k2","MPC-Q600160k2",2.7876506201989235,3.7773962852012568,3.4506266598725754,3.9871471460905026,2.9923664486567492,1.7280129536373061,3.3071637010660515,2.970950686797472,3.0314981002290882,3.7752837329029312,3.751151687023643,3.4064749951038702,2.8262451412305603,2.1458003033655983,1.4803085172928701,1.1071157013856245,1.2971480524778989,2.2437622609376953,3.4013747324147858,4.4772246696171534,5.3456947072590895,"Messdatum:","2012-10-16"]
["MPC-Q600160","k3","MPC-Q600160k3",28.856866590438219,28.533735686321691,43.469349019247453,46.064526379712525,51.811409851607927,56.853263184201516,56.501969754476846,55.122146667705564,55.854452139148236,56.383840629268207,61.114773341707291,68.578960843854091,78.020924305584842,86.794329521493708,92.845449634978507,90.337583737423728,77.396904580365742,53.944455561486095,32.950793612064324,14.488543627250486,1.6751421741109955]
["MPC-Q600160","k4","MPC-Q600160k4",-1.1119923355263732,-1.0055656286433983,-2.2421512776220207,-2.408914289461586,-2.9551828389329384,-3.4661841775498106,-3.3096920247418673,-3.2251570517384507,-3.279579916732954,-3.2621677412094345,-3.6474265593804156,-4.2801239788146885,-5.0921577729263907,-5.8581500058230791,-6.402368466426501,-6.2294366415520868,-5.1655712638146376,-3.1886973437445358,-1.3939253036141825,0.18912629652454627,1.2976887575354852]
["MPC-R300-S225","k1","MPC-R300-S225k1"]
["MPC-R300-S225","k2","MPC-R300-S225k2"]
["MPC-R300-S225","k3","MPC-R300-S225k3"]
["MPC-R300-S225","k4","MPC-R300-S225k4"]
["MPC-Q600200","k1",{"$f":"CONCATENATE(A68,B68)","v":"MPC-Q600200k1"},-12.692186993496387,-8.5900025097916846,-17.39058106189545,-19.086246236789723,-19.904843271036299,-21.394813315374481,-23.324494775606954,-23.245546295268209,-25.228529590848936,-26.083617702719231,-28.975074064609601,-32.624263443276021,-36.20844815581998,-39.260592801365057,-40.228288038150055,-39.064071210148981,-34.292313059596992,-26.027179335948496,-17.926752370496615,-9.8651023732827579,-2.4853945834462468]
["MPC-Q600200","k2","MPC-Q600200k2",4.4709140654589472,5.5802764009899164,5.1268790861957729,5.0972988522175173,4.4935834752222474,3.8984817287997662,4.6893444559415638,4.5975909861804212,4.5179823418172269,5.1100599807999592,5.0678470569340659,4.9338589370372752,4.8047752471650025,4.5337452417994086,4.3651280873959211,4.2216175514965553,4.0837882768000338,4.1244733659766082,4.322779885874855,4.5958514732614519,4.9246940853350507,"Messdatum:","2012-10-16"]
["MPC-Q600200","k3","MPC-Q600200k3",32.588971085734173,25.275072964055841,42.893186645262197,46.345595445227985,47.422622664953579,49.88693233465262,54.64061497405762,54.386708928175537,58.379083034133792,60.727268372533388,66.622577195811118,73.982049340021959,81.212960163781531,87.209345350635388,89.027828359852379,86.49355017057924,76.556991715145656,59.625442363674367,43.189805310433975,26.908634335421102,12.083690432268199]
["MPC-Q600200","k4","MPC-Q600200k4",-6.2706056826305829,-4.0923069810364492,-8.7654825882070035,-9.6658929424122633,-10.100580332216968,-10.891774143291769,-11.916439194582043,-11.874517678874088,-12.927499875796544,-13.381551106313692,-14.916939519355207,-16.854686693879241,-18.757918147080801,-20.378635432187224,-20.892495852131493,-20.274282825464692,-17.740444001480391,-13.35159343202919,-9.0502012964049108,-4.769402455548474,-0.8507258978495349]
["MPC-Q600225","k1","MPC-Q600225k1",-7.1722478491170456,-14.194489176053938,-16.606453867087122,-15.132917086648124,-19.880002368751345,-18.159265702324539,-21.788568900476761,-24.802141594675014,-28.078298410135545,-29.050840581782193,-30.698463791957277,-34.658509114896361,-36.74771373734081,-34.674788986814612,-32.332867687233332,-31.179634829578561,-23.824172862276285,-14.905313392503261,-6.235636359459833,0.50343833746053479,4.1279950524437208]
["MPC-Q600225","k2","MPC-Q600225k2",3.6423396187571222,3.53071898823932,3.9550877965474092,4.688982667018986,3.9604111953706265,4.3766327244312526,5.0169065500473407,4.5357623395161797,4.3743699838642751,4.7177306554409641,4.7233395035530643,4.3027382332579656,4.2003245405703726,4.2176319578187123,4.2329631408313801,3.8319073091020912,3.895237101775157,3.9307571383702888,4.3265119088692554,4.6869207906765453,5.0199421336748955]
["MPC-Q600225","k3","MPC-Q600225k3",22.009477441345897,37.678797442394412,43.523762858758175,40.946561614223562,50.885708320402024,47.435137757878749,56.23182395410759,62.522825559329917,69.723851652823683,72.252959696789574,75.961260147860315,84.439851193635903,89.032467055394349,84.391303361923804,79.143653969544161,76.150755996445781,59.68421028640072,39.676460780815141,20.589176892797141,5.8051632113415925,-2.0071656846963015]
["MPC-Q600225","k4","MPC-Q600225k4",-2.3667497807092959,-5.2597627524403476,-6.2534365667891709,-5.6463633073719812,-7.6020689803253765,-6.8931569072792787,-8.3883462905888013,-9.6298793994110294,-10.979589642030549,-11.380252677944759,-12.059037529410535,-13.690497595406567,-14.551209899280593,-13.697208578426793,-12.732386033101299,-12.257283376876085,-9.2269847483707466,-5.5526024759029537,-1.9808801858967893,0.79547060368297506,2.2887245744029299]
["MPC-Q600250","k1","MPC-Q600250k1",-7.1722478491170456,-14.194489176053938,-16.606453867087122,-15.132917086648124,-19.880002368751345,-18.159265702324539,-21.788568900476761,-24.802141594675014,-28.078298410135545,-29.050840581782193,-30.698463791957277,-34.658509114896361,-36.74771373734081,-34.674788986814612,-32.332867687233332,-31.179634829578561,-23.824172862276285,-14.905313392503261,-6.235636359459833,0.50343833746053479,4.1279950524437208]
["MPC-Q600250","k2","MPC-Q600250k2",3.6423396187571222,3.53071898823932,3.9550877965474092,4.688982667018986,3.9604111953706265,4.3766327244312526,5.0169065500473407,4.5357623395161797,4.3743699838642751,4.7177306554409641,4.7233395035530643,4.3027382332579656,4.2003245405703726,4.2176319578187123,4.2329631408313801,3.8319073091020912,3.895237101775157,3.9307571383702888,4.3265119088692554,4.6869207906765453,5.0199421336748955,"Messdatum:","2012-10-17"]
["MPC-Q600250","k3","MPC-Q600250k3",22.009477441345897,37.678797442394412,43.523762858758175,40.946561614223562,50.885708320402024,47.435137757878749,56.23182395410759,62.522825559329917,69.723851652823683,72.252959696789574,75.961260147860315,84.439851193635903,89.032467055394349,84.391303361923804,79.143653969544161,76.150755996445781,59.68421028640072,39.676460780815141,20.589176892797141,5.8051632113415925,-2.0071656846963015]
["MPC-Q600250","k4","MPC-Q600250k4",-2.3667497807092959,-5.2597627524403476,-6.2534365667891709,-5.6463633073719812,-7.6020689803253765,-6.8931569072792787,-8.3883462905888013,-9.6298793994110294,-10.979589642030549,-11.380252677944759,-12.059037529410535,-13.690497595406567,-14.551209899280593,-13.697208578426793,-12.732386033101299,-12.257283376876085,-9.2269847483707466,-5.5526024759029537,-1.9808801858967893,0.79547060368297506,2.2887245744029299]
["MPC-Q625125","k1","MPC-Q625125k1",-18.459900457105789,-26.345975505729161,-30.385940016098996,-23.000355931269262,-26.200804321478664,-30.385140108031766,-29.337922505476218,-29.901570044435005,-30.081000592897528,-27.095740017290229,-28.363212919414138,-30.842641115450263,-34.435534973941408,-39.19642324672197,-43.886529636656334,-46.655229500712522,-46.207501908290126,-40.568431722018957,-31.397526416956914,-21.354947639818178,-10.473151605972692]
["MPC-Q625125","k2","MPC-Q625125k2",2.7518802385308998,2.9075860826993063,3.900632876841386,4.9319697008091472,3.9015356016445124,2.9744630618878349,4.5786187443367572,4.0129729968250345,4.2291557136177813,5.0351280200506361,5.1593363841740301,4.9800907957101481,4.8086950636180896,4.2618641892572899,3.611941073156355,3.0449303741655043,2.7244021980283066,2.664426519201577,3.11633885303638,3.6908478064277626,4.516661716276019]
["MPC-Q625125","k3","MPC-Q625125k3",34.768948905303041,47.899214180261282,55.539304460849095,44.41988093479609,48.654635356246807,54.611536104850387,54.49325589260868,54.854770963848345,55.366228985803865,51.260975823569481,53.470522271636241,57.370473489744512,63.110217930167828,70.396040074942022,77.462305703462576,81.450312431303459,80.393049218073912,71.055406084956317,56.419075069815484,40.471268625072511,23.39418481376509]
["MPC-Q625125","k4","MPC-Q625125k4",-2.8136807911046327,-4.3591726521171541,-5.1509085303371416,-3.7034923340977195,-4.3307158290729122,-5.1507583823815022,-4.94551572913978,-5.0559818195473145,-5.0911442421996238,-4.5060949940740169,-4.7544899980542921,-5.240402532900637,-5.944530358543763,-6.8775619219489661,-7.7967230689562577,-8.339329480880691,-8.2515852339350548,-7.1464555995473598,-5.3491614575186315,-3.3810382480645553,-1.2484475434210218]
["MPC-R300-S250","k1","MPC-R300-S250k1"]
["MPC-R300-S250","k2","MPC-R300-S250k2"]
["MPC-R300-S250","k3","MPC-R300-S250k3"]
["MPC-R300-S250","k4","MPC-R300-S250k4"]
["MPC-Q625160","k1","MPC-Q625160k1",-13.017200001997832,-12.310903891526399,-20.51795900602534,-21.624770100663923,-25.250242021073991,-28.641624579672314,-27.603087099008778,-27.042022377419489,-27.40322033570229,-27.287699737511822,-29.844614004696751,-34.043727262716402,-39.433062071119984,-44.51681972611366,-48.12869218058453,-46.980946657856968,-39.920217227474183,-26.800008795785985,-14.888385370487974,-4.3818938204718663,2.9754582752469068]
["MPC-Q625160","k2","MPC-Q625160k2",2.7876506201989235,3.7773962852012568,3.4506266598725754,3.9871471460905026,2.9923664486567492,1.7280129536373061,3.3071637010660515,2.970950686797472,3.0314981002290882,3.7752837329029312,3.751151687023643,3.4064749951038702,2.8262451412305603,2.1458003033655983,1.4803085172928701,1.1071157013856245,1.2971480524778989,2.2437622609376953,3.4013747324147858,4.4772246696171534,5.3456947072590895]
["MPC-Q625160","k3","MPC-Q625160k3",28.856866590438219,28.533735686321691,43.469349019247453,46.064526379712525,51.811409851607927,56.853263184201516,56.501969754476846,55.122146667705564,55.854452139148236,56.383840629268207,61.114773341707291,68.578960843854091,78.020924305584842,86.794329521493708,92.845449634978507,90.337583737423728,77.396904580365742,53.944455561486095,32.950793612064324,14.488543627250486,1.6751421741109955]
["MPC-Q625160","k4","MPC-Q625160k4",-1.1119923355263732,-1.0055656286433983,-2.2421512776220207,-2.408914289461586,-2.9551828389329384,-3.4661841775498106,-3.3096920247418673,-3.2251570517384507,-3.279579916732954,-3.2621677412094345,-3.6474265593804156,-4.2801239788146885,-5.0921577729263907,-5.8581500058230791,-6.402368466426501,-6.2294366415520868,-5.1655712638146376,-3.1886973437445358,-1.3939253036141825,0.18912629652454627,1.2976887575354852]
["MPC-Q625200","k1","MPC-Q625200k1",-12.692186993496387,-8.5900025097916846,-17.39058106189545,-19.086246236789723,-19.904843271036299,-21.394813315374481,-23.324494775606954,-23.245546295268209,-25.228529590848936,-26.083617702719231,-28.975074064609601,-32.624263443276021,-36.20844815581998,-39.260592801365057,-40.228288038150055,-39.064071210148981,-34.292313059596992,-26.027179335948496,-17.926752370496615,-9.8651023732827579,-2.4853945834462468]
["MPC-Q625200","k2","MPC-Q625200k2",4.4709140654589472,5.5802764009899164,5.1268790861957729,5.0972988522175173,4.4935834752222474,3.8984817287997662,4.6893444559415638,4.5975909861804212,4.5179823418172269,5.1100599807999592,5.0678470569340659,4.9338589370372752,4.8047752471650025,4.5337452417994086,4.3651280873959211,4.2216175514965553,4.0837882768000338,4.1244733659766082,4.322779885874855,4.5958514732614519,4.9246940853350507]
["MPC-Q625200","k3","MPC-Q625200k3",32.588971085734173,25.275072964055841,42.893186645262197,46.345595445227985,47.422622664953579,49.88693233465262,54.64061497405762,54.386708928175537,58.379083034133792,60.727268372533388,66.622577195811118,73.982049340021959,81.212960163781531,87.209345350635388,89.027828359852379,86.49355017057924,76.556991715145656,59.625442363674367,43.189805310433975,26.908634335421102,12.083690432268199]
["MPC-Q625200","k4","MPC-Q625200k4",-6.2706056826305829,-4.0923069810364492,-8.7654825882070035,-9.6658929424122633,-10.100580332216968,-10.891774143291769,-11.916439194582043,-11.874517678874088,-12.927499875796544,-13.381551106313692,-14.916939519355207,-16.854686693879241,-18.757918147080801,-20.378635432187224,-20.892495852131493,-20.274282825464692,-17.740444001480391,-13.35159343202919,-9.0502012964049108,-4.769402455548474,-0.8507258978495349]
["MPC-Q625225","k1","MPC-Q625225k1",-7.1722478491170456,-14.194489176053938,-16.606453867087122,-15.132917086648124,-19.880002368751345,-18.159265702324539,-21.788568900476761,-24.802141594675014,-28.078298410135545,-29.050840581782193,-30.698463791957277,-34.658509114896361,-36.74771373734081,-34.674788986814612,-32.332867687233332,-31.179634829578561,-23.824172862276285,-14.905313392503261,-6.235636359459833,0.50343833746053479,4.1279950524437208]
["MPC-Q625225","k2","MPC-Q625225k2",3.6423396187571222,3.53071898823932,3.9550877965474092,4.688982667018986,3.9604111953706265,4.3766327244312526,5.0169065500473407,4.5357623395161797,4.3743699838642751,4.7177306554409641,4.7233395035530643,4.3027382332579656,4.2003245405703726,4.2176319578187123,4.2329631408313801,3.8319073091020912,3.895237101775157,3.9307571383702888,4.3265119088692554,4.6869207906765453,5.0199421336748955]
["MPC-Q625225","k3","MPC-Q625225k3",22.009477441345897,37.678797442394412,43.523762858758175,40.946561614223562,50.885708320402024,47.435137757878749,56.23182395410759,62.522825559329917,69.723851652823683,72.252959696789574,75.961260147860315,84.439851193635903,89.032467055394349,84.391303361923804,79.143653969544161,76.150755996445781,59.68421028640072,39.676460780815141,20.589176892797141,5.8051632113415925,-2.0071656846963015]
["MPC-Q625225","k4","MPC-Q625225k4",-2.3667497807092959,-5.2597627524403476,-6.2534365667891709,-5.6463633073719812,-7.6020689803253765,-6.8931569072792787,-8.3883462905888013,-9.6298793994110294,-10.979589642030549,-11.380252677944759,-12.059037529410535,-13.690497595406567,-14.551209899280593,-13.697208578426793,-12.732386033101299,-12.257283376876085,-9.2269847483707466,-5.5526024759029537,-1.9808801858967893,0.79547060368297506,2.2887245744029299]
["MPC-Q625250","k1","MPC-Q625250k1",-7.1722478491170456,-14.194489176053938,-16.606453867087122,-15.132917086648124,-19.880002368751345,-18.159265702324539,-21.788568900476761,-24.802141594675014,-28.078298410135545,-29.050840581782193,-30.698463791957277,-34.658509114896361,-36.74771373734081,-34.674788986814612,-32.332867687233332,-31.179634829578561,-23.824172862276285,-14.905313392503261,-6.235636359459833,0.50343833746053479,4.1279950524437208]
["MPC-Q625250","k2","MPC-Q625250k2",3.6423396187571222,3.53071898823932,3.9550877965474092,4.688982667018986,3.9604111953706265,4.3766327244312526,5.0169065500473407,4.5357623395161797,4.3743699838642751,4.7177306554409641,4.7233395035530643,4.3027382332579656,4.2003245405703726,4.2176319578187123,4.2329631408313801,3.8319073091020912,3.895237101775157,3.9307571383702888,4.3265119088692554,4.6869207906765453,5.0199421336748955]
["MPC-Q625250","k3","MPC-Q625250k3",22.009477441345897,37.678797442394412,43.523762858758175,40.946561614223562,50.885708320402024,47.435137757878749,56.23182395410759,62.522825559329917,69.723851652823683,72.252959696789574,75.961260147860315,84.439851193635903,89.032467055394349,84.391303361923804,79.143653969544161,76.150755996445781,59.68421028640072,39.676460780815141,20.589176892797141,5.8051632113415925,-2.0071656846963015]
["MPC-Q625250","k4","MPC-Q625250k4",-2.3667497807092959,-5.2597627524403476,-6.2534365667891709,-5.6463633073719812,-7.6020689803253765,-6.8931569072792787,-8.3883462905888013,-9.6298793994110294,-10.979589642030549,-11.380252677944759,-12.059037529410535,-13.690497595406567,-14.551209899280593,-13.697208578426793,-12.732386033101299,-12.257283376876085,-9.2269847483707466,-5.5526024759029537,-1.9808801858967893,0.79547060368297506,2.2887245744029299]
["MPC-R300-M125","k1","MPC-R300-M125k1"]
["MPC-R300-M125","k2","MPC-R300-M125k2"]
["MPC-R300-M125","k3","MPC-R300-M125k3"]
["MPC-R300-M125","k4","MPC-R300-M125k4"]
["MPC-R-S300100","k1","MPC-R-S300100k1",-5.7401093066052988,-5.4375803015264221,-15.558194391829817,-16.225685608669774,-13.387396228290807,-19.929690060006283,-24.247385061090739,-30.352351419655172,-34.147467909757957,-35.006395567913117,-40.626934674225467,-46.183496403201936,-50.075564026136796,-53.117272925841789,-49.680940917405046,-42.328408490485742,-33.77242173900072,-23.167735809564878,-12.895615577939299,-2.8390064305660005,4.3879698102213647]
["MPC-R-S300100","k2","MPC-R-S300100k2",5.1367190384866683,5.9447523366315886,8.028826574651406,9.7047038050064174,11.817345944411334,11.242480830816486,11.257559218925737,11.131063861562335,10.989471427763045,11.766498146115353,12.292663575365129,12.079510371109073,11.181298985389365,10.474101997117224,9.4283900685623951,8.4180521840178315,7.6035137087988991,6.8636720118466386,6.3241362766918892,5.861977667066717,5.6211358282574428,"Messdatum:","2012-10-02"]
["MPC-R-S300100","k3","MPC-R-S300100k3",14.920524603125426,15.28970792080878,32.063149638372437,34.708283397289918,32.702120253499096,41.622388536686742,47.904052806119914,56.638101249018135,62.00459821673698,64.02846081264704,72.712274236252412,80.563709446100802,85.314094508940784,89.021368403231207,82.987971094836965,71.30606257424617,58.073356704482187,41.941947824152209,26.493581437454996,11.435413259885093,0.70541263285099232]
["MPC-R-S300100","k4","MPC-R-S300100k4",-1.4452895350850039,-1.3355225355189597,-5.0073109851700028,-5.2494630181459776,-4.2196960542210933,-6.5932783245026272,-8.1597604783392192,-10.374674653112901,-11.75156437501424,-12.063178836305042,-14.102333615721577,-16.118287338965462,-17.530360283808495,-18.633919189428745,-17.387212154293277,-14.719683376537825,-11.615533209606347,-7.7681053090235039,-4.0413312931013179,-0.39274777230791924,2.2292479652083448]
["MPC-R-S300125","k1","MPC-R-S300125k1",-16.989657010294124,-8.4305387593233441,-13.836162580426441,-16.376295747861466,-13.770489979934386,-18.220183292742931,-21.97945767754025,-26.007468533432441,-28.853182209877591,-30.717337243394276,-36.030410631432446,-39.600416416880897,-37.733040714262401,-34.302404505164404,-27.590676603184288,-19.193209219853287,-11.194359033571404,-3.942020328693427,2.396666167680956,5.5332482953895834,6.7575764067073028]
["MPC-R-S300125","k2","MPC-R-S300125k2",7.5036510365432143,7.1643227111788805,8.5852381788627916,10.624733113112045,11.916305762479983,12.200606398344586,12.70517961577846,12.865371713817296,13.030442890565379,13.586921628119718,14.544849483100975,14.87020979529267,13.696911725460312,12.327110813146673,10.700400809247746,8.8001970860392138,7.2684503775444425,6.070551777620965,5.1741801729486374,4.8738921744365147,5.0198244905147824,"Messdatum:","2012-10-02"]
["MPC-R-S300125","k3","MPC-R-S300125k3",37.101319568930094,22.680733187540863,32.995129717604492,39.214036286455745,36.218915463199316,43.823776470945312,50.513105172441819,57.300075170882273,62.146856724055993,65.770308197070605,75.469344315751286,81.668023262297893,77.422317081777422,70.408229301898373,57.739242668360156,42.023371968020051,27.331831951644482,14.202343910967139,2.8775390549206801,-2.5830786837406912,-4.4513806394715836]
["MPC-R-S300125","k4","MPC-R-S300125k4",-8.8484915752625906,-4.1627460980150763,-7.1220776518506002,-8.5126712330267331,-7.0860948270905775,-9.5221053240392095,-11.580134010754035,-13.785307035686408,-15.343209207197379,-16.363749336901495,-19.27241634214689,-21.22683319455394,-20.204537231795591,-18.326424625117134,-14.652059124912684,-10.054829392244372,-5.6758170387300497,-1.7054851262535968,1.7646754474791557,3.4818334855999593,4.1521061206210899]
["MPC-R-S300160","k1","MPC-R-S300160k1",-5.9181610121502555,-7.9851657274562546,-12.092220405841564,-12.972775174080335,-11.23821627448072,-14.152948070377692,-16.822890463688932,-20.759168307064861,-21.586593749629621,-22.48378323898114,-25.850147957262394,-28.915112548782901,-29.367547214458245,-27.774449635215561,-22.227091354159548,-13.596641729901016,-6.5083818844011718,-0.87167104873493884,3.7972873913447875,5.1918626597454391,5.8103121466598351]
["MPC-R-S300160","k2","MPC-R-S300160k2",5.2907904499880791,6.7441963811094565,9.3364733448335375,11.521362358294382,12.75648975099166,13.151715836981158,14.553318387467158,15.348898534240188,15.378229195686091,15.75703602376921,16.833454013497697,17.58368743486227,16.789316549662288,15.537185833090158,13.132694333310475,9.8558023121160243,7.462788543220146,5.7367605943226305,4.4983093370237954,4.3662621209050441,4.5750815141299306,"Messdatum:","2012-10-04"]
["MPC-R-S300160","k3","MPC-R-S300160k3",18.15678169806576,23.454259515393769,33.684482352809162,37.507362057106619,35.517298992011156,41.332720744699238,47.699582274930059,55.815082961121057,57.383075246007706,59.430344563234058,66.766942622665624,73.21682493313088,73.26358005466723,69.048681198908611,56.327981938637016,37.001495531878952,21.426876895481197,9.2186479630517795,-0.70233935282789417,-3.4277403660641763,-4.3689205708297383]
["MPC-R-S300160","k4","MPC-R-S300160k4",-3.7509556919092994,-5.1704455018681701,-7.9909168137079005,-8.5956128644564807,-7.4044060749299767,-9.4060753999436582,-11.239629005758916,-13.942834409511832,-14.5110581493069,-15.1271950948555,-17.439024699579246,-19.543860617538805,-19.854573983493687,-18.760535039162168,-14.950942622752292,-9.0240624852285674,-4.1562670234865919,-0.28530402178945813,2.9210801410201173,3.8788015824287929,4.3035229415428615]
["MPC-R-L400125","k1","MPC-R-L400125k1"]
["MPC-R-L400125","k2","MPC-R-L400125k2"]
["MPC-R-L400125","k3","MPC-R-L400125k3"]
["MPC-R-L400125","k4","MPC-R-L400125k4"]
["MPC-R300-M160","k1","MPC-R300-M160k1"]
["MPC-R300-M160","k2","MPC-R300-M160k2"]
["MPC-R300-M160","k3","MPC-R300-M160k3"]
["MPC-R300-M160","k4","MPC-R300-M160k4"]
["MPC-R-L400160","k1","MPC-R-L400160k1"]
["MPC-R-L400160","k2","MPC-R-L400160k2"]
["MPC-R-L400160","k3","MPC-R-L400160k3"]
["MPC-R-L400160","k4","MPC-R-L400160k4"]
["MPC-R-L400200","k1",{"$f":"CONCATENATE(A132,B132)","v":"MPC-R-L400200k1"}]
["MPC-R-L400200","k2","MPC-R-L400200k2"]
["MPC-R-L400200","k3","MPC-R-L400200k3"]
["MPC-R-L400200","k4","MPC-R-L400200k4"]
["MPC-R-L400225","k1","MPC-R-L400225k1"]
["MPC-R-L400225","k2","MPC-R-L400225k2"]
["MPC-R-L400225","k3","MPC-R-L400225k3"]
["MPC-R-L400225","k4","MPC-R-L400225k4"]
["MPC-R-L400250","k1","MPC-R-L400250k1"]
["MPC-R-L400250","k2","MPC-R-L400250k2"]
["MPC-R-L400250","k3","MPC-R-L400250k3"]
["MPC-R-L400250","k4","MPC-R-L400250k4"]
["MPC-R300-M200","k1","MPC-R300-M200k1"]
["MPC-R300-M200","k2","MPC-R300-M200k2"]
["MPC-R300-M200","k3","MPC-R300-M200k3"]
["MPC-R300-M200","k4","MPC-R300-M200k4"]
["MPC-R-M400125","k1","MPC-R-M400125k1"]
["MPC-R-M400125","k2","MPC-R-M400125k2"]
["MPC-R-M400125","k3","MPC-R-M400125k3"]
["MPC-R-M400125","k4","MPC-R-M400125k4"]
["MPC-R-M400160","k1","MPC-R-M400160k1"]
["MPC-R-M400160","k2","MPC-R-M400160k2"]
["MPC-R-M400160","k3","MPC-R-M400160k3"]
["MPC-R-M400160","k4","MPC-R-M400160k4"]
["MPC-R-M400200","k1","MPC-R-M400200k1"]
["MPC-R-M400200","k2","MPC-R-M400200k2"]
["MPC-R-M400200","k3","MPC-R-M400200k3"]
["MPC-R-M400200","k4","MPC-R-M400200k4"]
["MPC-R-M400225","k1","MPC-R-M400225k1"]
["MPC-R-M400225","k2","MPC-R-M400225k2"]
["MPC-R-M400225","k3","MPC-R-M400225k3"]
["MPC-R-M400225","k4","MPC-R-M400225k4"]
["MPC-R300-M225","k1","MPC-R300-M225k1"]
["MPC-R300-M225","k2","MPC-R300-M225k2"]
["MPC-R300-M225","k3","MPC-R300-M225k3"]
["MPC-R300-M225","k4","MPC-R300-M225k4"]
["MPC-R-M400250","k1","MPC-R-M400250k1"]
["MPC-R-M400250","k2","MPC-R-M400250k2"]
["MPC-R-M400250","k3","MPC-R-M400250k3"]
["MPC-R-M400250","k4","MPC-R-M400250k4"]
["MPC-R-S400125","k1","MPC-R-S400125k1"]
["MPC-R-S400125","k2","MPC-R-S400125k2"]
["MPC-R-S400125","k3","MPC-R-S400125k3"]
["MPC-R-S400125","k4","MPC-R-S400125k4"]
["MPC-R-S400160","k1","MPC-R-S400160k1"]
["MPC-R-S400160","k2","MPC-R-S400160k2"]
["MPC-R-S400160","k3","MPC-R-S400160k3"]
["MPC-R-S400160","k4","MPC-R-S400160k4"]
["MPC-R-S400200","k1","MPC-R-S400200k1"]
["MPC-R-S400200","k2","MPC-R-S400200k2"]
["MPC-R-S400200","k3","MPC-R-S400200k3"]
["MPC-R-S400200","k4","MPC-R-S400200k4"]
["MPC-R300-M250","k1","MPC-R300-M250k1"]
["MPC-R300-M250","k2","MPC-R300-M250k2"]
["MPC-R300-M250","k3","MPC-R300-M250k3"]
["MPC-R300-M250","k4","MPC-R300-M250k4"]
["MPC-R-S400225","k1","MPC-R-S400225k1"]
["MPC-R-S400225","k2","MPC-R-S400225k2"]
["MPC-R-S400225","k3","MPC-R-S400225k3"]
["MPC-R-S400225","k4","MPC-R-S400225k4"]
["MPC-R-S400250","k1","MPC-R-S400250k1"]
["MPC-R-S400250","k2","MPC-R-S400250k2"]
["MPC-R-S400250","k3","MPC-R-S400250k3"]
["MPC-R-S400250","k4","MPC-R-S400250k4"]
["MPC-R-L500125","k1",{"$f":"CONCATENATE(A196,B196)","v":"MPC-R-L500125k1"}]
["MPC-R-L500125","k2","MPC-R-L500125k2"]
["MPC-R-L500125","k3","MPC-R-L500125k3"]
["MPC-R-L500125","k4","MPC-R-L500125k4"]
["MPC-R-L500160","k1","MPC-R-L500160k1"]
["MPC-R-L500160","k2","MPC-R-L500160k2"]
["MPC-R-L500160","k3","MPC-R-L500160k3"]
["MPC-R-L500160","k4","MPC-R-L500160k4"]
["MPC-R300-L125","k1","MPC-R300-L125k1"]
["MPC-R300-L125","k2","MPC-R300-L125k2"]
["MPC-R300-L125","k3","MPC-R300-L125k3"]
["MPC-R300-L125","k4","MPC-R300-L125k4"]
["MPC-R-L500200","k1","MPC-R-L500200k1"]
["MPC-R-L500200","k2","MPC-R-L500200k2"]
["MPC-R-L500200","k3","MPC-R-L500200k3"]
["MPC-R-L500200","k4","MPC-R-L500200k4"]
["MPC-R-L500225","k1","MPC-R-L500225k1"]
["MPC-R-L500225","k2","MPC-R-L500225k2"]
["MPC-R-L500225","k3","MPC-R-L500225k3"]
["MPC-R-L500225","k4","MPC-R-L500225k4"]
["MPC-R-L500250","k1","MPC-R-L500250k1"]
["MPC-R-L500250","k2","MPC-R-L500250k2"]
["MPC-R-L500250","k3","MPC-R-L500250k3"]
["MPC-R-L500250","k4","MPC-R-L500250k4"]
["MPC-R-M500125","k1","MPC-R-M500125k1"]
["MPC-R-M500125","k2","MPC-R-M500125k2"]
["MPC-R-M500125","k3","MPC-R-M500125k3"]
["MPC-R-M500125","k4","MPC-R-M500125k4"]
["MPC-R300-L160","k1","MPC-R300-L160k1"]
["MPC-R300-L160","k2","MPC-R300-L160k2"]
["MPC-R300-L160","k3","MPC-R300-L160k3"]
["MPC-R300-L160","k4","MPC-R300-L160k4"]
["MPC-R-M500160","k1","MPC-R-M500160k1"]
["MPC-R-M500160","k2","MPC-R-M500160k2"]
["MPC-R-M500160","k3","MPC-R-M500160k3"]
["MPC-R-M500160","k4","MPC-R-M500160k4"]
["MPC-R-M500200","k1","MPC-R-M500200k1"]
["MPC-R-M500200","k2","MPC-R-M500200k2"]
["MPC-R-M500200","k3","MPC-R-M500200k3"]
["MPC-R-M500200","k4","MPC-R-M500200k4"]
["MPC-R-M500225","k1","MPC-R-M500225k1"]
["MPC-R-M500225","k2","MPC-R-M500225k2"]
["MPC-R-M500225","k3","MPC-R-M500225k3"]
["MPC-R-M500225","k4","MPC-R-M500225k4"]
["MPC-R-M500250","k1","MPC-R-M500250k1"]
["MPC-R-M500250","k2","MPC-R-M500250k2"]
["MPC-R-M500250","k3","MPC-R-M500250k3"]
["MPC-R-M500250","k4","MPC-R-M500250k4"]
["MPC-R300-L200","k1","MPC-R300-L200k1"]
["MPC-R300-L200","k2","MPC-R300-L200k2"]
["MPC-R300-L200","k3","MPC-R300-L200k3"]
["MPC-R300-L200","k4","MPC-R300-L200k4"]
["MPC-R-S500125","k1","MPC-R-S500125k1"]
["MPC-R-S500125","k2","MPC-R-S500125k2"]
["MPC-R-S500125","k3","MPC-R-S500125k3"]
["MPC-R-S500125","k4","MPC-R-S500125k4"]
["MPC-R-S500160","k1","MPC-R-S500160k1"]
["MPC-R-S500160","k2","MPC-R-S500160k2"]
["MPC-R-S500160","k3","MPC-R-S500160k3"]
["MPC-R-S500160","k4","MPC-R-S500160k4"]
["MPC-R-S500200","k1","MPC-R-S500200k1"]
["MPC-R-S500200","k2","MPC-R-S500200k2"]
["MPC-R-S500200","k3","MPC-R-S500200k3"]
["MPC-R-S500200","k4","MPC-R-S500200k4"]
["MPC-R-S500225","k1",{"$f":"CONCATENATE(A260,B260)","v":"MPC-R-S500225k1"}]
["MPC-R-S500225","k2","MPC-R-S500225k2"]
["MPC-R-S500225","k3","MPC-R-S500225k3"]
["MPC-R-S500225","k4","MPC-R-S500225k4"]
["MPC-R300-L225","k1","MPC-R300-L225k1"]
["MPC-R300-L225","k2","MPC-R300-L225k2"]
["MPC-R300-L225","k3","MPC-R300-L225k3"]
["MPC-R300-L225","k4","MPC-R300-L225k4"]
["MPC-R-S500250","k1","MPC-R-S500250k1"]
["MPC-R-S500250","k2","MPC-R-S500250k2"]
["MPC-R-S500250","k3","MPC-R-S500250k3"]
["MPC-R-S500250","k4","MPC-R-S500250k4"]
["MPC-R-L600125","k1","MPC-R-L600125k1",-38.708578928091384,-36.249588875455721,-32.096700079596474,-30.108875905830111,-33.822461625763054,-34.001114971869242,-33.431416060097902,-35.458624366765214,-37.33404705553432,-41.830924930255485,-46.208753278701892,-47.426458094484012,-47.919045640561613,-46.060414455432706,-47.288860068467955,-49.026690279504294,-50.77100642135224,-50.055887542777917,-44.670412398914003,-35.578904767195425,-24.08806507089739]
["MPC-R-L600125","k2","MPC-R-L600125k2",0.57438413759525886,2.6805810883196193,4.4686702532006626,4.8227166206042469,3.290816728985281,3.9101922179226341,4.6985215052787188,4.4285285669244496,4.2179143154580636,3.5847502339963477,3.0030143929919251,2.618552618154586,2.451757350203446,2.4420215739592344,2.0522751440456717,1.6704898942914357,1.2957661068548765,1.0854224577080294,1.3644186299945511,2.0175099364650388,2.9219348990591185,"Messdatum:","2012-10-05"]
["MPC-R-L600125","k3","MPC-R-L600125k3",65.905882238982784,63.967355608027461,58.923664812026672,56.007367902829536,60.584592767322384,61.498189754269376,61.349597576120814,64.414773737062646,67.289627100094265,74.054746820780593,80.675449350011334,82.294270572630069,82.937834596528759,79.870134338566416,81.501334623653847,83.97857037692637,86.47353675151642,85.08654109568046,76.505102862651995,62.200507022894485,44.199822758939227]
["MPC-R-L600125","k4","MPC-R-L600125k4",-10.06095512992067,-9.375969930391161,-8.2191467842461439,-7.6654250334696208,-8.6998769365470405,-8.7496336964558772,-8.5909351556782365,-9.1556229607027628,-9.678030269403024,-10.930657528376731,-12.150125648980309,-12.489327705832938,-12.626542231929184,-12.108810524938336,-12.451004931733635,-12.935088324318469,-13.420978020509835,-13.221781560310774,-11.721635599856032,-9.1891552526453122,-5.9883297265320303]
["MPC-R-L600160","k1","MPC-R-L600160k1",-19.951687025455765,-19.220442981462188,-19.262519279495432,-19.665432868842171,-22.692749120561391,-21.829625529008048,-21.698669465980377,-22.132155595324196,-24.017887635747165,-27.192785192687492,-33.179203971463544,-37.275658935379049,-39.723736963983932,-40.411363607613595,-40.33179312757197,-38.91757504405642,-36.064588525862305,-28.780729247090477,-18.678139219603558,-9.0092727313083358,-0.54694658830152365]
["MPC-R-L600160","k2","MPC-R-L600160k2",2.9912498775806164,5.0727257873523639,6.3499955648091548,6.7356673136049485,5.6619131447704882,6.5130844502935812,7.3679010804262557,7.3244942680368901,7.4167657607516393,7.173795693527298,6.3279499647929969,5.7657655249133537,5.3907399850645499,4.8296986039666185,4.4580238603116573,4.2766480209477233,4.1549006925150413,4.2432411433979098,4.5857872175806298,4.933494196766901,5.3057179164302903,"Messdatum:","2012-10-16"]
["MPC-R-L600160","k3","MPC-R-L600160k3",41.955199935802789,42.677666145801993,44.033727667152434,45.168842404816836,49.724365496887152,48.970794470799667,49.58244441455809,50.345146536203927,53.94425434927912,59.605374447037576,69.891814150293357,76.947375251260709,81.124770070428951,81.842275598273631,81.322472336780734,78.511069536280374,73.083710933090344,59.626624315184714,41.182029571878246,23.549219598718597,8.1847200209613415]
["MPC-R-L600160","k4","MPC-R-L600160k4",-5.6326816903587558,-5.4011669718064255,-5.4144752419734479,-5.5420227001905529,-6.5003953256800768,-6.2271470937891547,-6.185681930137644,-6.3229109516194111,-6.9198796934356492,-7.924965931024416,-9.8201058774164309,-11.11693580582201,-11.8919317955037,-12.10962535685425,-12.0844393788672,-11.636738386237749,-10.733564511294489,-8.4276944294365457,-5.2294941071076124,-2.1686016026325863,0.51032822454526006]
["MPC-R-L600200","k1","MPC-R-L600200k1",-12.446684453817889,-14.417130472630076,-15.88348376437234,-17.534690658864861,-19.673930462702906,-19.649152754828965,-20.271247046823113,-21.781002273432293,-22.758042902609589,-28.161320203681807,-33.557993546175339,-37.112628438421439,-38.785534261812948,-36.797206326944689,-33.917189293061099,-28.776392351640716,-20.868757701624506,-11.506630528362587,-3.0906218601755877,2.276619073670112,4.5397601599217303]
["MPC-R-L600200","k2","MPC-R-L600200k2",5.1611444294971909,6.2330402806012266,7.3518536506474756,8.0149432085482957,7.2612588778646696,8.0496927302949555,8.5543863721787314,8.8070662263902904,8.9714908748626687,9.1784556468078833,8.9750146101052142,8.5857673879279783,8.2698499464628945,7.4421317104602123,7.0471744549075108,6.5705787997148981,5.9747504333473946,5.3999783928160934,5.0727007607971988,4.8372920736623088,4.4760396978293304,"Messdatum:","2012-10-16"]
["MPC-R-L600200","k3","MPC-R-L600200k3",32.775291205004585,37.893867993659768,42.024279318988775,46.078318821199609,49.717015632350858,50.454961600775455,52.237324513159528,55.590293223189029,57.761073517730495,69.063334205596902,79.941448560164531,86.851177306636231,89.970293393074513,85.059298867731528,78.750261742700417,67.717196507363994,50.883356413105261,31.083918854760565,13.475071578758289,2.2181295387863833,-2.7905412780770309]
["MPC-R-L600200","k4","MPC-R-L600200k4",-6.2384563113462068,-7.2991594731173501,-8.0885038781212764,-8.977361459793082,-10.128951540582468,-10.115603178521196,-10.450478235491021,-11.263197070928843,-11.789148319896373,-14.69780062817704,-17.602905716387454,-19.516417921712115,-20.416970942629749,-19.346640397328283,-17.796293240052059,-15.028938119655269,-10.772158297649151,-5.7324102066193587,-1.201959884215678,1.6872897522595798,2.9055743752141119]
["MPC-R300-L250","k1","MPC-R300-L250k1"]
["MPC-R300-L250","k2","MPC-R300-L250k2"]
["MPC-R300-L250","k3","MPC-R300-L250k3"]
["MPC-R300-L250","k4","MPC-R300-L250k4"]
["MPC-R-L600225","k1","MPC-R-L600225k1",-5.7866966559005064,-11.605757856769232,-13.64907418589857,-16.320010758923612,-17.196901470255927,-17.615950260799455,-19.88198159094236,-21.502465904225488,-23.538506998850664,-25.284809317340471,-29.235278538859735,-32.877045670350043,-35.027569643785306,-32.979541904459253,-30.096391828031518,-29.708338614649502,-22.146476124088434,-13.463342892974472,-4.6031837089626482,1.3340990396937349,4.2047773120844534]
["MPC-R-L600225","k2","MPC-R-L600225k2",6.8949384464247352,8.13702683684145,8.9890517001145742,9.4960490302190337,9.1064414032565431,10.120754035173558,10.779118449392602,11.190960437962548,11.802745533585108,12.249245539245438,12.57000136133794,12.639848543312548,12.327145292468218,11.452059124549534,10.704841762198241,10.145137361341497,8.6986276111283374,7.0914542825129914,5.8151992005069921,4.9052252691389722,4.6317380836219773]
["MPC-R-L600225","k3","MPC-R-L600225k3",22.150489714364785,36.469791737030604,41.914074199217225,48.423435796455927,50.004055758060872,51.960764275469955,57.711720607855732,61.765336374875154,66.952855691919908,71.323881827095164,80.522182095828043,88.775693667692607,93.295319143017338,87.817378740865379,80.59074846384928,79.158623815129175,60.718410360237151,39.597752502454263,18.410441395409222,4.1577935761506621,-2.5668275639633453]
["MPC-R-L600225","k4","MPC-R-L600225k4",-3.9678180665051399,-8.2274000043159852,-9.7231108944220068,-11.678250539503177,-12.32014563658981,-12.626880329506042,-14.285623937742901,-15.471826212652351,-16.962214299517903,-18.240515474042798,-21.132285624460579,-23.798087551704882,-25.372290406051356,-23.873133083701504,-21.762652416230015,-21.478603025550964,-15.943277690022374,-9.587179882849167,-3.1014910699405731,1.2446371915329579,3.3460043837881321]
["MPC-R-L600250","k1","MPC-R-L600250k1",-5.7866966559005064,-11.605757856769232,-13.64907418589857,-16.320010758923612,-17.196901470255927,-17.615950260799455,-19.88198159094236,-21.502465904225488,-23.538506998850664,-25.284809317340471,-29.235278538859735,-32.877045670350043,-35.027569643785306,-32.979541904459253,-30.096391828031518,-29.708338614649502,-22.146476124088434,-13.463342892974472,-4.6031837089626482,1.3340990396937349,4.2047773120844534]
["MPC-R-L600250","k2","MPC-R-L600250k2",6.8949384464247352,8.13702683684145,8.9890517001145742,9.4960490302190337,9.1064414032565431,10.120754035173558,10.779118449392602,11.190960437962548,11.802745533585108,12.249245539245438,12.57000136133794,12.639848543312548,12.327145292468218,11.452059124549534,10.704841762198241,10.145137361341497,8.6986276111283374,7.0914542825129914,5.8151992005069921,4.9052252691389722,4.6317380836219773,"Messdatum:","2012-10-17"]
["MPC-R-L600250","k3","MPC-R-L600250k3",22.150489714364785,36.469791737030604,41.914074199217225,48.423435796455927,50.004055758060872,51.960764275469955,57.711720607855732,61.765336374875154,66.952855691919908,71.323881827095164,80.522182095828043,88.775693667692607,93.295319143017338,87.817378740865379,80.59074846384928,79.158623815129175,60.718410360237151,39.597752502454263,18.410441395409222,4.1577935761506621,-2.5668275639633453]
["MPC-R-L600250","k4","MPC-R-L600250k4",-3.9678180665051399,-8.2274000043159852,-9.7231108944220068,-11.678250539503177,-12.32014563658981,-12.626880329506042,-14.285623937742901,-15.471826212652351,-16.962214299517903,-18.240515474042798,-21.132285624460579,-23.798087551704882,-25.372290406051356,-23.873133083701504,-21.762652416230015,-21.478603025550964,-15.943277690022374,-9.587179882849167,-3.1014910699405731,1.2446371915329579,3.3460043837881321]
["MPC-R-M600125","k1","MPC-R-M600125k1",-31.634538509684266,-30.64398778626321,-26.486665803086581,-26.397883772597847,-29.544291095306612,-29.176485789194508,-29.25524256078393,-31.259876771684816,-34.180535300155242,-36.559663293955857,-39.645348311000738,-40.958295648871214,-41.355332785123338,-42.019609887643924,-43.334837152365864,-44.963834484302751,-45.329829548165563,-43.783026221721819,-38.419585881756042,-30.42325802366889,-19.563735013526042]
["MPC-R-M600125","k2","MPC-R-M600125k2",2.3345763695344988,4.4121127470196715,6.0063396956325246,5.8843654453740797,4.6576542744742113,5.4703766914786787,5.8835020611288531,5.7092474007958023,5.3105768707850256,5.1104539645896132,4.7287569153398508,4.4082733744483233,4.1514934795861862,3.6534811007570278,3.3558262101020055,2.8770035346960734,2.5665478780045867,2.4671273891752876,2.7540475750744897,3.1644889058269907,3.8691769457300049,"Messdatum:","2012-10-05"]
["MPC-R-M600125","k3","MPC-R-M600125k3",56.027397086433801,56.476025964891384,51.231047586171748,50.96295653788524,54.912389639825179,55.120295667469883,55.663164620532065,58.786960118464819,63.193354157789045,66.907406699415574,71.602293452871436,73.441820401527409,73.838169261214261,74.432880016831007,76.298979724606582,78.500088791912447,78.791675866143194,76.147350366074065,67.610154206084971,54.864769795662852,37.703085097897159]
["MPC-R-M600125","k4","MPC-R-M600125k4",-8.9274073230199313,-8.626057855608197,-7.3613824369366938,-7.3343756086533212,-8.2915282989252752,-8.1796328482524849,-8.2035851082594391,-8.813398328760119,-9.7018686774550549,-10.425601905509499,-11.364271369473755,-11.763673340070538,-11.884456447123826,-12.086536438308412,-12.486630760255009,-12.982177282245029,-13.093517984892101,-12.622982503889135,-10.991417150705198,-8.5589263637061208,-5.2554483480257108]
["MPC-R-M600160","k1","MPC-R-M600160k1",-18.65545337661128,-18.712896744127534,-17.798458187313233,-19.10569380581002,-21.740448598219039,-22.893998377727431,-23.876804531036083,-24.859411191322788,-27.003328844991593,-30.561133466798033,-34.314174646266913,-37.036065956681789,-37.64365092076094,-37.5712978593982,-33.939910834294132,-29.729475383434234,-24.807427034294022,-17.696393089021992,-9.6010575539233791,-2.5566910361461046,3.2894124373096236]
["MPC-R-M600160","k2","MPC-R-M600160k2",3.7495273921875065,5.7348380674568791,7.394308944362157,7.462221419517161,6.457804075490758,7.2602609062675034,7.8011340193613545,7.8656825307231442,7.7161505315038399,7.5348517549903971,7.4244289654134672,7.2158368647646105,7.1855119205744762,5.8573985610890267,5.6254761009627572,5.4882028508733995,5.3484723172182234,5.291008027446626,5.4269947706918105,5.4914467005072618,5.585201195984995,"Messdatum:","2012-10-16"]
["MPC-R-M600160","k3","MPC-R-M600160k3",40.302390353165045,42.39507204624649,42.354508134919058,44.85341508741238,48.74837041522045,51.696229140045872,54.064910793655457,55.956757977466907,59.794077002692497,66.228927535375618,73.09774711307989,77.950820348865975,79.050349954727608,77.587361591153439,70.602329769298237,62.635141132723923,53.342174825586063,40.060800774732009,25.142524014408565,12.107124745608875,1.3292885385573163]
["MPC-R-M600160","k4","MPC-R-M600160k4",-5.1214098586424006,-5.1392843705618683,-4.854483134641721,-5.261605184153237,-6.0821719755212547,-6.4414248474881832,-6.7475033105976427,-7.0535222868417202,-7.7212197191600218,-8.8292540529990102,-9.9980935732386147,-10.845794735731733,-11.035017024053571,-11.012498563486789,-9.8815498527941674,-8.5702615722213444,-7.0373518932561421,-4.8227107057477756,-2.3015230898134664,-0.10764973560236557,1.7130511414902498]
["MPC-R-M600200","k1","MPC-R-M600200k1",-13.383716010818734,-14.60289256501072,-15.082570531575804,-15.467525554509901,-17.526686958364696,-18.322077212677737,-20.303868267956261,-21.870294091221062,-23.454670289552823,-26.087072457563757,-29.096977090978033,-32.377763404648647,-33.895974631372667,-28.444304480884227,-25.085207673767538,-23.481926218757113,-17.389035336938203,-10.860217066768477,-3.0628834920144725,1.9247232148845492,4.7702662516476346]
["MPC-R-M600200","k2","MPC-R-M600200k2",6.0200338670448668,7.1485167319691074,8.246644733604386,8.6120416061841532,7.9892788008704532,9.1374794675398405,9.6061130602599203,10.053229367216165,10.332359586676789,10.606255279989805,10.618639646261459,10.545473265271983,9.9757008869725556,8.9400809701044501,8.3066711154388546,7.6841155630215985,6.9893990128751131,6.1461621601342111,5.476946466423926,5.0545973983547201,5.0183304784404408,"Messdatum:","2012-10-16"]
["MPC-R-M600200","k3","MPC-R-M600200k3",35.5578011955823,39.190153299282883,41.27365619341689,42.429653736668854,46.034972009340734,48.816842537420008,53.355078748542518,57.018868685189794,60.551473061329581,66.230867225704969,72.423832141311607,79.087447408043559,81.634993198800785,69.404476593263311,61.873230072303627,57.958259429082119,44.752077845688909,30.50219171412601,13.821596616573675,3.1574545370472524,-2.7219795848910993]
["MPC-R-M600200","k4","MPC-R-M600200k4",-6.7801317395069693,-7.4395772769510362,-7.6990242322092506,-7.90724414313976,-9.0210576176350123,-9.4512753095337914,-10.523225155365548,-11.370505654196617,-12.227496644014405,-13.651365694536295,-15.279433203642656,-17.054021972645351,-17.875231616051398,-14.926416999925179,-13.109478584719954,-12.242264667177444,-8.9466102413586359,-5.4151635068191872,-1.1975741607439034,1.5002384597222433,3.0394131101728439]
["MPC-R-M600225","k1","MPC-R-M600225k1",-4.2313726571972969,-9.897703264408733,-11.462035009818146,-9.3399220593974768,-11.943010106007392,-10.461546102621936,-14.587288593241242,-16.809144890102257,-17.778492629342882,-20.668758220305708,-24.275691169235536,-25.913409681631801,-27.001015374225027,-22.291834501523436,-18.26958782633643,-16.597545406043022,-10.806418197974436,-4.913642688209408,0.32034758312205253,3.182448487138172,4.4492898078158847]
["MPC-R-M600225","k2","MPC-R-M600225k2",6.7902956438052797,9.4480522271011225,10.379292606381298,10.261074905191098,10.528994559776399,11.242274168326373,12.680915233576618,13.784973700213394,14.807277002895702,15.853379203603566,16.797302729218956,16.646046547114079,16.302527302617172,13.904588511004006,12.15372796192622,11.063955942730658,8.9181019610907359,6.7206288883584682,5.1971781734969378,4.3553597475338082,4.2582518349213467]
["MPC-R-M600225","k3","MPC-R-M600225k3",18.548453292200993,33.940301851259477,38.387177980582734,33.500206389438958,39.617760178539271,37.002232650746542,47.7125756913562,53.809887298958905,57.010846694245686,64.552201449551958,73.601794341060696,77.130684645941969,79.231051769112298,66.249976775366576,55.459881500439145,50.612361059880399,35.452172809711698,20.011925051716645,6.7263409286674394,-0.54740025355574873,-3.4913658819768476]
["MPC-R-M600225","k4","MPC-R-M600225k4",-3.7141974647754843,-8.8203712909644487,-10.230056820546039,-8.3177271387292979,-10.663484384724471,-9.3284693305676569,-13.046354686507035,-15.048563575443307,-15.922083875902425,-18.526628677150839,-21.776991866468119,-23.252812645699443,-24.232904078860379,-19.989259342795439,-16.364641426812536,-14.857891838881031,-9.6392577898150158,-4.3290215280766624,0.38755491492090011,2.9667244212597303,4.1083341268864402]
["MPC-R-M600250","k1","MPC-R-M600250k1",-4.2313726571972969,-9.897703264408733,-11.462035009818146,-9.3399220593974768,-11.943010106007392,-10.461546102621936,-14.587288593241242,-16.809144890102257,-17.778492629342882,-20.668758220305708,-24.275691169235536,-25.913409681631801,-27.001015374225027,-22.291834501523436,-18.26958782633643,-16.597545406043022,-10.806418197974436,-4.913642688209408,0.32034758312205253,3.182448487138172,4.4492898078158847]
["MPC-R-M600250","k2","MPC-R-M600250k2",6.7902956438052797,9.4480522271011225,10.379292606381298,10.261074905191098,10.528994559776399,11.242274168326373,12.680915233576618,13.784973700213394,14.807277002895702,15.853379203603566,16.797302729218956,16.646046547114079,16.302527302617172,13.904588511004006,12.15372796192622,11.063955942730658,8.9181019610907359,6.7206288883584682,5.1971781734969378,4.3553597475338082,4.2582518349213467,"Messdatum:","2012-10-17"]
["MPC-R-M600250","k3","MPC-R-M600250k3",18.548453292200993,33.940301851259477,38.387177980582734,33.500206389438958,39.617760178539271,37.002232650746542,47.7125756913562,53.809887298958905,57.010846694245686,64.552201449551958,73.601794341060696,77.130684645941969,79.231051769112298,66.249976775366576,55.459881500439145,50.612361059880399,35.452172809711698,20.011925051716645,6.7263409286674394,-0.54740025355574873,-3.4913658819768476]
["MPC-R-M600250","k4","MPC-R-M600250k4",-3.7141974647754843,-8.8203712909644487,-10.230056820546039,-8.3177271387292979,-10.663484384724471,-9.3284693305676569,-13.046354686507035,-15.048563575443307,-15.922083875902425,-18.526628677150839,-21.776991866468119,-23.252812645699443,-24.232904078860379,-19.989259342795439,-16.364641426812536,-14.857891838881031,-9.6392577898150158,-4.3290215280766624,0.38755491492090011,2.9667244212597303,4.1083341268864402]
["MPC-R-S600125","k1","MPC-R-S600125k1",-30.983582606381542,-30.836021460648713,-26.985094000382567,-26.726795425827842,-30.632246510607086,-28.673357422334316,-27.521557862039703,-27.185840715027691,-29.813187291545155,-33.994884800379893,-39.924360357223357,-42.850939062234012,-44.554633026219868,-44.484350381304225,-47.167715599421783,-50.636004357893462,-50.499905167846343,-43.46916249642107,-30.847960958645327,-16.103367209584665,-3.3465683023130794]
["MPC-R-S600125","k2","MPC-R-S600125k2",4.0266050277864043,5.9255533075171645,7.119459050298782,6.7838995740173997,5.7264025177091655,6.640642399743383,7.0613377849079795,7.2836016313641183,7.3769051806632895,7.335111551324351,7.0885788481489413,6.8290400050635833,6.4646840488909358,5.9308186588968708,5.4773773603726514,4.9067008110846038,4.4075438182356574,4.231684976237637,4.4507177223122776,4.7757876572308779,5.1781828849354135,"Messdatum:","2012-10-05"]
["MPC-R-S600125","k3","MPC-R-S600125k3",56.650104672179509,58.307704989852631,53.16683495994814,52.406051269609819,57.773137553581279,55.465241721905088,53.99127644341835,53.661376075338055,58.077359640542547,64.915416985956256,74.42409884293896,78.979285717474824,81.417649613659208,80.767744933927872,84.728752268680324,89.863835729560819,89.140391502067558,77.397128854612717,56.851395603587413,32.918339894587966,12.333129323626412]
["MPC-R-S600125","k4","MPC-R-S600125k4",-9.6740764178696281,-9.6247880575082938,-8.3395588685688704,-8.2533613222499156,-9.5567837748308957,-8.9030073227919004,-8.5185986926543773,-8.4065515077139494,-9.2833986532650012,-10.678993835015797,-12.657897010502827,-13.634615531721479,-14.203213467347808,-14.17976899342295,-15.075322042510875,-16.232841164148262,-16.187431288320582,-13.840999863450339,-9.6288029380820781,-4.7079505862831796,-0.45050718384013982]
["MPC-R-S600160","k1","MPC-R-S600160k1",-17.612936682874757,-16.673010715652705,-15.989240177483577,-18.525677038239241,-20.457188143866858,-20.128708880570006,-20.306458000231665,-20.019402679430137,-21.696821479306212,-24.701802933881179,-28.211712558021386,-31.981795789170366,-33.67995947377549,-36.335505983848279,-36.101465571807999,-34.309906430357287,-32.664043237970553,-28.536155140848518,-21.502347398930027,-13.027983638582,-4.9887448943810142]
["MPC-R-S600160","k2","MPC-R-S600160k2",5.1902757360873268,7.4089957249480998,8.6029494253677079,8.4911821814361588,7.7930414723366264,8.63181560565436,9.1539178732256801,9.5065829464913225,9.7330117967489915,9.9074050099672899,9.9913590522670592,9.6838038738562879,9.2618757659102808,8.4827547606168618,7.9546883739224485,7.560490639565419,7.3203628143466055,7.0759745729623678,6.7999645637282002,6.3666707167048422,6.0437905397699385,"Messdatum:","2012-10-16"]
["MPC-R-S600160","k3","MPC-R-S600160k3",39.804674607877594,40.276102216443675,40.198845992484713,44.803848535910049,47.697390423808734,47.925552679226058,48.778346049569421,48.597298617378819,51.943147259404988,57.705715202003326,64.316789588796723,71.020085509560488,73.75598655781836,77.914971116451341,76.951543985060439,73.225609654449968,69.924731275184101,62.003953790662621,48.647635572387848,32.455121721326314,17.182249411189499]
["MPC-R-S600160","k4","MPC-R-S600160k4",-7.0590525573306238,-6.6520609878427415,-6.3559903410608465,-7.4542272684295225,-8.2905447279029669,-8.1483120751895495,-8.2252698646650355,-8.1009779759635876,-8.8272689854925854,-10.128376494240173,-11.648108555332726,-13.280497300357197,-14.015779985943237,-15.165595030553883,-15.064263907761379,-14.28855225519748,-13.575922548709844,-11.788613255953054,-8.7430901255284894,-5.0738322773442963,-1.5929792764950774]
["MPC-R-S600200","k1",{"$f":"CONCATENATE(A324,B324)","v":"MPC-R-S600200k1"},-12.507515497505601,-12.515011220721719,-12.707254894612992,-13.905474406599417,-15.184042593168082,-15.656973512157707,-17.139543045165535,-17.392359737097589,-19.219781634333973,-21.957336534980499,-24.408973398668856,-26.636290805409896,-29.584878445954981,-25.728868461342735,-23.452529697564483,-23.208765364497545,-20.002496356015516,-15.606281815473697,-8.7484822512110352,-2.8342161744059866,1.9455452912366482]
["MPC-R-S600200","k2","MPC-R-S600200k2",6.7166053753450585,7.7107702654246166,8.9125154898799277,9.3981175328583113,9.0953825303880436,10.13484364337299,10.547260333393655,11.239393811336631,12.060204223686165,12.67800267814023,12.926144889703769,12.816212411324337,12.650191990543913,11.284647150818405,10.558217128961838,9.9955400644549233,9.3629408055453229,8.4497919324715891,7.3601292875510103,6.3676251630790279,5.6851784482015297,"Messdatum:","2012-10-16"]
["MPC-R-S600200","k3","MPC-R-S600200k3",34.454671169605184,35.464463522578733,37.061253216010705,40.007410270646446,42.330027836838404,44.340861566902142,47.797703318700854,49.009138620531225,53.582596147250051,59.821866560034543,65.104290296312129,69.567926985449077,75.456530870092337,66.17268397818475,60.771818997324239,59.708460677690695,52.491920882417318,42.55131575398385,27.379503852153515,14.242358896756947,3.7448855728736223]
["MPC-R-S600200","k4","MPC-R-S600200k4",-6.3471546382530359,-6.3512256767027546,-6.455787544016661,-7.1075367479221576,-7.8029947877694266,-8.0602313867313349,-8.8666493337416146,-9.0041608147106214,-9.9981527260791143,-11.487196102194233,-12.820724147575191,-14.032237421285265,-15.636075299547981,-13.538669097659591,-12.300493645324458,-12.16790711850528,-10.423912183286168,-8.0326681813789182,-4.3024856782457217,-1.0855203873922352,1.5143573354093336]
["MPC-R-S600225","k1","MPC-R-S600225k1",-2.7513771255384953,-6.3832917759324879,-8.2385543581383516,-8.6218173884247822,-9.1624040818747474,-9.6364868028796646,-11.49675227030318,-12.557046514947279,-14.321711528966034,-16.269292654295313,-17.70608466585869,-20.025770505515943,-20.432190252603768,-16.03251948210751,-13.055419183106046,-12.392819494218594,-9.4662147023008067,-5.9978783382806586,-1.438141658246197,1.625575041708146,3.3998474579160929]
["MPC-R-S600225","k2","MPC-R-S600225k2",7.5027423513874707,10.040987910427871,11.41617642959827,12.328504345679512,12.40246483270561,13.871741529973034,15.082631202527665,16.342586784155589,18.257008838561163,19.579320041182566,20.168646718330596,21.101634614993905,20.689038120978964,17.220686937328306,15.057631126111296,14.018441269135415,12.051565701794638,9.8288680396567187,7.2341446953519633,5.3257946387096018,4.1743166425276925]
["MPC-R-S600225","k3","MPC-R-S600225k3",15.933936874470126,26.634165773931016,32.178693650016193,33.952422443204561,35.241198302147289,37.776058445965162,43.167489216568903,46.810329574003383,52.690557881128171,58.389654560811543,62.207834495196821,68.353718408162919,68.854364169789704,55.498582305725691,46.645092426956289,44.116781909425669,35.572958769635363,25.555916733410591,12.714210816977202,3.9208401929512191,-1.2179378197920143]
["MPC-R-S600225","k4","MPC-R-S600225k4",-2.9755208736291729,-6.8244347817407371,-8.7905456830336934,-9.19670806055775,-9.7695940524159344,-10.272003803071282,-12.243415280403564,-13.367060567998095,-15.237160415170612,-17.301104694026606,-18.823743165557676,-21.282021910773672,-21.712722768927101,-17.050182011563436,-13.89520628651859,-13.19301814575706,-10.091555341009853,-6.4159934732181432,-1.5838230360959831,1.6629427947284265,3.5432216258076226]
["MPC-R-S600250","k1","MPC-R-S600250k1",-2.7513771255384953,-6.3832917759324879,-8.2385543581383516,-8.6218173884247822,-9.1624040818747474,-9.6364868028796646,-11.49675227030318,-12.557046514947279,-14.321711528966034,-16.269292654295313,-17.70608466585869,-20.025770505515943,-20.432190252603768,-16.03251948210751,-13.055419183106046,-12.392819494218594,-9.4662147023008067,-5.9978783382806586,-1.438141658246197,1.625575041708146,3.3998474579160929]
["MPC-R-S600250","k2","MPC-R-S600250k2",7.5027423513874707,10.040987910427871,11.41617642959827,12.328504345679512,12.40246483270561,13.871741529973034,15.082631202527665,16.342586784155589,18.257008838561163,19.579320041182566,20.168646718330596,21.101634614993905,20.689038120978964,17.220686937328306,15.057631126111296,14.018441269135415,12.051565701794638,9.8288680396567187,7.2341446953519633,5.3257946387096018,4.1743166425276925,"Messdatum:","2012-10-17"]
["MPC-R-S600250","k3","MPC-R-S600250k3",15.933936874470126,26.634165773931016,32.178693650016193,33.952422443204561,35.241198302147289,37.776058445965162,43.167489216568903,46.810329574003383,52.690557881128171,58.389654560811543,62.207834495196821,68.353718408162919,68.854364169789704,55.498582305725691,46.645092426956289,44.116781909425669,35.572958769635363,25.555916733410591,12.714210816977202,3.9208401929512191,-1.2179378197920143]
["MPC-R-S600250","k4","MPC-R-S600250k4",-2.9755208736291729,-6.8244347817407371,-8.7905456830336934,-9.19670806055775,-9.7695940524159344,-10.272003803071282,-12.243415280403564,-13.367060567998095,-15.237160415170612,-17.301104694026606,-18.823743165557676,-21.282021910773672,-21.712722768927101,-17.050182011563436,-13.89520628651859,-13.19301814575706,-10.091555341009853,-6.4159934732181432,-1.5838230360959831,1.6629427947284265,3.5432216258076226]
["MPC-R-L625125","k1","MPC-R-L625125k1",-38.708578928091384,-36.249588875455721,-32.096700079596474,-30.108875905830111,-33.822461625763054,-34.001114971869242,-33.431416060097902,-35.458624366765214,-37.33404705553432,-41.830924930255485,-46.208753278701892,-47.426458094484012,-47.919045640561613,-46.060414455432706,-47.288860068467955,-49.026690279504294,-50.77100642135224,-50.055887542777917,-44.670412398914003,-35.578904767195425,-24.08806507089739]
["MPC-R-L625125","k2","MPC-R-L625125k2",0.57438413759525886,2.6805810883196193,4.4686702532006626,4.8227166206042469,3.290816728985281,3.9101922179226341,4.6985215052787188,4.4285285669244496,4.2179143154580636,3.5847502339963477,3.0030143929919251,2.618552618154586,2.451757350203446,2.4420215739592344,2.0522751440456717,1.6704898942914357,1.2957661068548765,1.0854224577080294,1.3644186299945511,2.0175099364650388,2.9219348990591185]
["MPC-R-L625125","k3","MPC-R-L625125k3",65.905882238982784,63.967355608027461,58.923664812026672,56.007367902829536,60.584592767322384,61.498189754269376,61.349597576120814,64.414773737062646,67.289627100094265,74.054746820780593,80.675449350011334,82.294270572630069,82.937834596528759,79.870134338566416,81.501334623653847,83.97857037692637,86.47353675151642,85.08654109568046,76.505102862651995,62.200507022894485,44.199822758939227]
["MPC-R-L625125","k4","MPC-R-L625125k4",-10.06095512992067,-9.375969930391161,-8.2191467842461439,-7.6654250334696208,-8.6998769365470405,-8.7496336964558772,-8.5909351556782365,-9.1556229607027628,-9.678030269403024,-10.930657528376731,-12.150125648980309,-12.489327705832938,-12.626542231929184,-12.108810524938336,-12.451004931733635,-12.935088324318469,-13.420978020509835,-13.221781560310774,-11.721635599856032,-9.1891552526453122,-5.9883297265320303]
["MPC-R-L625160","k1","MPC-R-L625160k1",-19.951687025455765,-19.220442981462188,-19.262519279495432,-19.665432868842171,-22.692749120561391,-21.829625529008048,-21.698669465980377,-22.132155595324196,-24.017887635747165,-27.192785192687492,-33.179203971463544,-37.275658935379049,-39.723736963983932,-40.411363607613595,-40.33179312757197,-38.91757504405642,-36.064588525862305,-28.780729247090477,-18.678139219603558,-9.0092727313083358,-0.54694658830152365]
["MPC-R-L625160","k2","MPC-R-L625160k2",2.9912498775806164,5.0727257873523639,6.3499955648091548,6.7356673136049485,5.6619131447704882,6.5130844502935812,7.3679010804262557,7.3244942680368901,7.4167657607516393,7.173795693527298,6.3279499647929969,5.7657655249133537,5.3907399850645499,4.8296986039666185,4.4580238603116573,4.2766480209477233,4.1549006925150413,4.2432411433979098,4.5857872175806298,4.933494196766901,5.3057179164302903]
["MPC-R-L625160","k3","MPC-R-L625160k3",41.955199935802789,42.677666145801993,44.033727667152434,45.168842404816836,49.724365496887152,48.970794470799667,49.58244441455809,50.345146536203927,53.94425434927912,59.605374447037576,69.891814150293357,76.947375251260709,81.124770070428951,81.842275598273631,81.322472336780734,78.511069536280374,73.083710933090344,59.626624315184714,41.182029571878246,23.549219598718597,8.1847200209613415]
["MPC-R-L625160","k4","MPC-R-L625160k4",-5.6326816903587558,-5.4011669718064255,-5.4144752419734479,-5.5420227001905529,-6.5003953256800768,-6.2271470937891547,-6.185681930137644,-6.3229109516194111,-6.9198796934356492,-7.924965931024416,-9.8201058774164309,-11.11693580582201,-11.8919317955037,-12.10962535685425,-12.0844393788672,-11.636738386237749,-10.733564511294489,-8.4276944294365457,-5.2294941071076124,-2.1686016026325863,0.51032822454526006]
["MPC-R-L625200","k1","MPC-R-L625200k1",-12.446684453817889,-14.417130472630076,-15.88348376437234,-17.534690658864861,-19.673930462702906,-19.649152754828965,-20.271247046823113,-21.781002273432293,-22.758042902609589,-28.161320203681807,-33.557993546175339,-37.112628438421439,-38.785534261812948,-36.797206326944689,-33.917189293061099,-28.776392351640716,-20.868757701624506,-11.506630528362587,-3.0906218601755877,2.276619073670112,4.5397601599217303]
["MPC-R-L625200","k2","MPC-R-L625200k2",5.1611444294971909,6.2330402806012266,7.3518536506474756,8.0149432085482957,7.2612588778646696,8.0496927302949555,8.5543863721787314,8.8070662263902904,8.9714908748626687,9.1784556468078833,8.9750146101052142,8.5857673879279783,8.2698499464628945,7.4421317104602123,7.0471744549075108,6.5705787997148981,5.9747504333473946,5.3999783928160934,5.0727007607971988,4.8372920736623088,4.4760396978293304]
["MPC-R-L625200","k3","MPC-R-L625200k3",32.775291205004585,37.893867993659768,42.024279318988775,46.078318821199609,49.717015632350858,50.454961600775455,52.237324513159528,55.590293223189029,57.761073517730495,69.063334205596902,79.941448560164531,86.851177306636231,89.970293393074513,85.059298867731528,78.750261742700417,67.717196507363994,50.883356413105261,31.083918854760565,13.475071578758289,2.2181295387863833,-2.7905412780770309]
["MPC-R-L625200","k4","MPC-R-L625200k4",-6.2384563113462068,-7.2991594731173501,-8.0885038781212764,-8.977361459793082,-10.128951540582468,-10.115603178521196,-10.450478235491021,-11.263197070928843,-11.789148319896373,-14.69780062817704,-17.602905716387454,-19.516417921712115,-20.416970942629749,-19.346640397328283,-17.796293240052059,-15.028938119655269,-10.772158297649151,-5.7324102066193587,-1.201959884215678,1.6872897522595798,2.9055743752141119]
["MPC-R-L625225","k1","MPC-R-L625225k1",-5.7866966559005064,-11.605757856769232,-13.64907418589857,-16.320010758923612,-17.196901470255927,-17.615950260799455,-19.88198159094236,-21.502465904225488,-23.538506998850664,-25.284809317340471,-29.235278538859735,-32.877045670350043,-35.027569643785306,-32.979541904459253,-30.096391828031518,-29.708338614649502,-22.146476124088434,-13.463342892974472,-4.6031837089626482,1.3340990396937349,4.2047773120844534]
["MPC-R-L625225","k2","MPC-R-L625225k2",6.8949384464247352,8.13702683684145,8.9890517001145742,9.4960490302190337,9.1064414032565431,10.120754035173558,10.779118449392602,11.190960437962548,11.802745533585108,12.249245539245438,12.57000136133794,12.639848543312548,12.327145292468218,11.452059124549534,10.704841762198241,10.145137361341497,8.6986276111283374,7.0914542825129914,5.8151992005069921,4.9052252691389722,4.6317380836219773]
["MPC-R-L625225","k3","MPC-R-L625225k3",22.150489714364785,36.469791737030604,41.914074199217225,48.423435796455927,50.004055758060872,51.960764275469955,57.711720607855732,61.765336374875154,66.952855691919908,71.323881827095164,80.522182095828043,88.775693667692607,93.295319143017338,87.817378740865379,80.59074846384928,79.158623815129175,60.718410360237151,39.597752502454263,18.410441395409222,4.1577935761506621,-2.5668275639633453]
["MPC-R-L625225","k4","MPC-R-L625225k4",-3.9678180665051399,-8.2274000043159852,-9.7231108944220068,-11.678250539503177,-12.32014563658981,-12.626880329506042,-14.285623937742901,-15.471826212652351,-16.962214299517903,-18.240515474042798,-21.132285624460579,-23.798087551704882,-25.372290406051356,-23.873133083701504,-21.762652416230015,-21.478603025550964,-15.943277690022374,-9.587179882849167,-3.1014910699405731,1.2446371915329579,3.3460043837881321]
["MPC-R-L625250","k1","MPC-R-L625250k1",-5.7866966559005064,-11.605757856769232,-13.64907418589857,-16.320010758923612,-17.196901470255927,-17.615950260799455,-19.88198159094236,-21.502465904225488,-23.538506998850664,-25.284809317340471,-29.235278538859735,-32.877045670350043,-35.027569643785306,-32.979541904459253,-30.096391828031518,-29.708338614649502,-22.146476124088434,-13.463342892974472,-4.6031837089626482,1.3340990396937349,4.2047773120844534]
["MPC-R-L625250","k2","MPC-R-L625250k2",6.8949384464247352,8.13702683684145,8.9890517001145742,9.4960490302190337,9.1064414032565431,10.120754035173558,10.779118449392602,11.190960437962548,11.802745533585108,12.249245539245438,12.57000136133794,12.639848543312548,12.327145292468218,11.452059124549534,10.704841762198241,10.145137361341497,8.6986276111283374,7.0914542825129914,5.8151992005069921,4.9052252691389722,4.6317380836219773]
["MPC-R-L625250","k3","MPC-R-L625250k3",22.150489714364785,36.469791737030604,41.914074199217225,48.423435796455927,50.004055758060872,51.960764275469955,57.711720607855732,61.765336374875154,66.952855691919908,71.323881827095164,80.522182095828043,88.775693667692607,93.295319143017338,87.817378740865379,80.59074846384928,79.158623815129175,60.718410360237151,39.597752502454263,18.410441395409222,4.1577935761506621,-2.5668275639633453]
["MPC-R-L625250","k4","MPC-R-L625250k4",-3.9678180665051399,-8.2274000043159852,-9.7231108944220068,-11.678250539503177,-12.32014563658981,-12.626880329506042,-14.285623937742901,-15.471826212652351,-16.962214299517903,-18.240515474042798,-21.132285624460579,-23.798087551704882,-25.372290406051356,-23.873133083701504,-21.762652416230015,-21.478603025550964,-15.943277690022374,-9.587179882849167,-3.1014910699405731,1.2446371915329579,3.3460043837881321]
["MPC-R-M625125","k1","MPC-R-M625125k1",-31.634538509684266,-30.64398778626321,-26.486665803086581,-26.397883772597847,-29.544291095306612,-29.176485789194508,-29.25524256078393,-31.259876771684816,-34.180535300155242,-36.559663293955857,-39.645348311000738,-40.958295648871214,-41.355332785123338,-42.019609887643924,-43.334837152365864,-44.963834484302751,-45.329829548165563,-43.783026221721819,-38.419585881756042,-30.42325802366889,-19.563735013526042]
["MPC-R-M625125","k2","MPC-R-M625125k2",2.3345763695344988,4.4121127470196715,6.0063396956325246,5.8843654453740797,4.6576542744742113,5.4703766914786787,5.8835020611288531,5.7092474007958023,5.3105768707850256,5.1104539645896132,4.7287569153398508,4.4082733744483233,4.1514934795861862,3.6534811007570278,3.3558262101020055,2.8770035346960734,2.5665478780045867,2.4671273891752876,2.7540475750744897,3.1644889058269907,3.8691769457300049]
["MPC-R-M625125","k3","MPC-R-M625125k3",56.027397086433801,56.476025964891384,51.231047586171748,50.96295653788524,54.912389639825179,55.120295667469883,55.663164620532065,58.786960118464819,63.193354157789045,66.907406699415574,71.602293452871436,73.441820401527409,73.838169261214261,74.432880016831007,76.298979724606582,78.500088791912447,78.791675866143194,76.147350366074065,67.610154206084971,54.864769795662852,37.703085097897159]
["MPC-R-M625125","k4","MPC-R-M625125k4",-8.9274073230199313,-8.626057855608197,-7.3613824369366938,-7.3343756086533212,-8.2915282989252752,-8.1796328482524849,-8.2035851082594391,-8.813398328760119,-9.7018686774550549,-10.425601905509499,-11.364271369473755,-11.763673340070538,-11.884456447123826,-12.086536438308412,-12.486630760255009,-12.982177282245029,-13.093517984892101,-12.622982503889135,-10.991417150705198,-8.5589263637061208,-5.2554483480257108]
["MPC-R-M625160","k1","MPC-R-M625160k1",-18.65545337661128,-18.712896744127534,-17.798458187313233,-19.10569380581002,-21.740448598219039,-22.893998377727431,-23.876804531036083,-24.859411191322788,-27.003328844991593,-30.561133466798033,-34.314174646266913,-37.036065956681789,-37.64365092076094,-37.5712978593982,-33.939910834294132,-29.729475383434234,-24.807427034294022,-17.696393089021992,-9.6010575539233791,-2.5566910361461046,3.2894124373096236]
["MPC-R-M625160","k2","MPC-R-M625160k2",3.7495273921875065,5.7348380674568791,7.394308944362157,7.462221419517161,6.457804075490758,7.2602609062675034,7.8011340193613545,7.8656825307231442,7.7161505315038399,7.5348517549903971,7.4244289654134672,7.2158368647646105,7.1855119205744762,5.8573985610890267,5.6254761009627572,5.4882028508733995,5.3484723172182234,5.291008027446626,5.4269947706918105,5.4914467005072618,5.585201195984995]
["MPC-R-M625160","k3","MPC-R-M625160k3",40.302390353165045,42.39507204624649,42.354508134919058,44.85341508741238,48.74837041522045,51.696229140045872,54.064910793655457,55.956757977466907,59.794077002692497,66.228927535375618,73.09774711307989,77.950820348865975,79.050349954727608,77.587361591153439,70.602329769298237,62.635141132723923,53.342174825586063,40.060800774732009,25.142524014408565,12.107124745608875,1.3292885385573163]
["MPC-R-M625160","k4","MPC-R-M625160k4",-5.1214098586424006,-5.1392843705618683,-4.854483134641721,-5.261605184153237,-6.0821719755212547,-6.4414248474881832,-6.7475033105976427,-7.0535222868417202,-7.7212197191600218,-8.8292540529990102,-9.9980935732386147,-10.845794735731733,-11.035017024053571,-11.012498563486789,-9.8815498527941674,-8.5702615722213444,-7.0373518932561421,-4.8227107057477756,-2.3015230898134664,-0.10764973560236557,1.7130511414902498]
["MPC-V300-/-225","k1","MPC-V300-/-225k1"]
["MPC-V300-/-225","k2","MPC-V300-/-225k2"]
["MPC-V300-/-225","k3","MPC-V300-/-225k3"]
["MPC-V300-/-225","k4","MPC-V300-/-225k4"]
["MPC-R-M625200","k1","MPC-R-M625200k1",-13.383716010818734,-14.60289256501072,-15.082570531575804,-15.467525554509901,-17.526686958364696,-18.322077212677737,-20.303868267956261,-21.870294091221062,-23.454670289552823,-26.087072457563757,-29.096977090978033,-32.377763404648647,-33.895974631372667,-28.444304480884227,-25.085207673767538,-23.481926218757113,-17.389035336938203,-10.860217066768477,-3.0628834920144725,1.9247232148845492,4.7702662516476346]
["MPC-R-M625200","k2","MPC-R-M625200k2",6.0200338670448668,7.1485167319691074,8.246644733604386,8.6120416061841532,7.9892788008704532,9.1374794675398405,9.6061130602599203,10.053229367216165,10.332359586676789,10.606255279989805,10.618639646261459,10.545473265271983,9.9757008869725556,8.9400809701044501,8.3066711154388546,7.6841155630215985,6.9893990128751131,6.1461621601342111,5.476946466423926,5.0545973983547201,5.0183304784404408]
["MPC-R-M625200","k3","MPC-R-M625200k3",35.5578011955823,39.190153299282883,41.27365619341689,42.429653736668854,46.034972009340734,48.816842537420008,53.355078748542518,57.018868685189794,60.551473061329581,66.230867225704969,72.423832141311607,79.087447408043559,81.634993198800785,69.404476593263311,61.873230072303627,57.958259429082119,44.752077845688909,30.50219171412601,13.821596616573675,3.1574545370472524,-2.7219795848910993]
["MPC-R-M625200","k4","MPC-R-M625200k4",-6.7801317395069693,-7.4395772769510362,-7.6990242322092506,-7.90724414313976,-9.0210576176350123,-9.4512753095337914,-10.523225155365548,-11.370505654196617,-12.227496644014405,-13.651365694536295,-15.279433203642656,-17.054021972645351,-17.875231616051398,-14.926416999925179,-13.109478584719954,-12.242264667177444,-8.9466102413586359,-5.4151635068191872,-1.1975741607439034,1.5002384597222433,3.0394131101728439]
["MPC-R-M625225","k1","MPC-R-M625225k1",-4.2313726571972969,-9.897703264408733,-11.462035009818146,-9.3399220593974768,-11.943010106007392,-10.461546102621936,-14.587288593241242,-16.809144890102257,-17.778492629342882,-20.668758220305708,-24.275691169235536,-25.913409681631801,-27.001015374225027,-22.291834501523436,-18.26958782633643,-16.597545406043022,-10.806418197974436,-4.913642688209408,0.32034758312205253,3.182448487138172,4.4492898078158847]
["MPC-R-M625225","k2","MPC-R-M625225k2",6.7902956438052797,9.4480522271011225,10.379292606381298,10.261074905191098,10.528994559776399,11.242274168326373,12.680915233576618,13.784973700213394,14.807277002895702,15.853379203603566,16.797302729218956,16.646046547114079,16.302527302617172,13.904588511004006,12.15372796192622,11.063955942730658,8.9181019610907359,6.7206288883584682,5.1971781734969378,4.3553597475338082,4.2582518349213467]
["MPC-R-M625225","k3","MPC-R-M625225k3",18.548453292200993,33.940301851259477,38.387177980582734,33.500206389438958,39.617760178539271,37.002232650746542,47.7125756913562,53.809887298958905,57.010846694245686,64.552201449551958,73.601794341060696,77.130684645941969,79.231051769112298,66.249976775366576,55.459881500439145,50.612361059880399,35.452172809711698,20.011925051716645,6.7263409286674394,-0.54740025355574873,-3.4913658819768476]
["MPC-R-M625225","k4","MPC-R-M625225k4",-3.7141974647754843,-8.8203712909644487,-10.230056820546039,-8.3177271387292979,-10.663484384724471,-9.3284693305676569,-13.046354686507035,-15.048563575443307,-15.922083875902425,-18.526628677150839,-21.776991866468119,-23.252812645699443,-24.232904078860379,-19.989259342795439,-16.364641426812536,-14.857891838881031,-9.6392577898150158,-4.3290215280766624,0.38755491492090011,2.9667244212597303,4.1083341268864402]
["MPC-R-M625250","k1","MPC-R-M625250k1",-4.2313726571972969,-9.897703264408733,-11.462035009818146,-9.3399220593974768,-11.943010106007392,-10.461546102621936,-14.587288593241242,-16.809144890102257,-17.778492629342882,-20.668758220305708,-24.275691169235536,-25.913409681631801,-27.001015374225027,-22.291834501523436,-18.26958782633643,-16.597545406043022,-10.806418197974436,-4.913642688209408,0.32034758312205253,3.182448487138172,4.4492898078158847]
["MPC-R-M625250","k2","MPC-R-M625250k2",6.7902956438052797,9.4480522271011225,10.379292606381298,10.261074905191098,10.528994559776399,11.242274168326373,12.680915233576618,13.784973700213394,14.807277002895702,15.853379203603566,16.797302729218956,16.646046547114079,16.302527302617172,13.904588511004006,12.15372796192622,11.063955942730658,8.9181019610907359,6.7206288883584682,5.1971781734969378,4.3553597475338082,4.2582518349213467]
["MPC-R-M625250","k3","MPC-R-M625250k3",18.548453292200993,33.940301851259477,38.387177980582734,33.500206389438958,39.617760178539271,37.002232650746542,47.7125756913562,53.809887298958905,57.010846694245686,64.552201449551958,73.601794341060696,77.130684645941969,79.231051769112298,66.249976775366576,55.459881500439145,50.612361059880399,35.452172809711698,20.011925051716645,6.7263409286674394,-0.54740025355574873,-3.4913658819768476]
["MPC-R-M625250","k4","MPC-R-M625250k4",-3.7141974647754843,-8.8203712909644487,-10.230056820546039,-8.3177271387292979,-10.663484384724471,-9.3284693305676569,-13.046354686507035,-15.048563575443307,-15.922083875902425,-18.526628677150839,-21.776991866468119,-23.252812645699443,-24.232904078860379,-19.989259342795439,-16.364641426812536,-14.857891838881031,-9.6392577898150158,-4.3290215280766624,0.38755491492090011,2.9667244212597303,4.1083341268864402]
["MPC-R-S625125","k1","MPC-R-S625125k1",-30.983582606381542,-30.836021460648713,-26.985094000382567,-26.726795425827842,-30.632246510607086,-28.673357422334316,-27.521557862039703,-27.185840715027691,-29.813187291545155,-33.994884800379893,-39.924360357223357,-42.850939062234012,-44.554633026219868,-44.484350381304225,-47.167715599421783,-50.636004357893462,-50.499905167846343,-43.46916249642107,-30.847960958645327,-16.103367209584665,-3.3465683023130794]
["MPC-R-S625125","k2","MPC-R-S625125k2",4.0266050277864043,5.9255533075171645,7.119459050298782,6.7838995740173997,5.7264025177091655,6.640642399743383,7.0613377849079795,7.2836016313641183,7.3769051806632895,7.335111551324351,7.0885788481489413,6.8290400050635833,6.4646840488909358,5.9308186588968708,5.4773773603726514,4.9067008110846038,4.4075438182356574,4.231684976237637,4.4507177223122776,4.7757876572308779,5.1781828849354135]
["MPC-R-S625125","k3","MPC-R-S625125k3",56.650104672179509,58.307704989852631,53.16683495994814,52.406051269609819,57.773137553581279,55.465241721905088,53.99127644341835,53.661376075338055,58.077359640542547,64.915416985956256,74.42409884293896,78.979285717474824,81.417649613659208,80.767744933927872,84.728752268680324,89.863835729560819,89.140391502067558,77.397128854612717,56.851395603587413,32.918339894587966,12.333129323626412]
["MPC-R-S625125","k4","MPC-R-S625125k4",-9.6740764178696281,-9.6247880575082938,-8.3395588685688704,-8.2533613222499156,-9.5567837748308957,-8.9030073227919004,-8.5185986926543773,-8.4065515077139494,-9.2833986532650012,-10.678993835015797,-12.657897010502827,-13.634615531721479,-14.203213467347808,-14.17976899342295,-15.075322042510875,-16.232841164148262,-16.187431288320582,-13.840999863450339,-9.6288029380820781,-4.7079505862831796,-0.45050718384013982]
["MPC-V300-/-250","k1","MPC-V300-/-250k1"]
["MPC-V300-/-250","k2","MPC-V300-/-250k2"]
["MPC-V300-/-250","k3","MPC-V300-/-250k3"]
["MPC-V300-/-250","k4","MPC-V300-/-250k4"]
["MPC-R-S625160","k1",{"$f":"CONCATENATE(A388,B388)","v":"MPC-R-S625160k1"},-17.612936682874757,-16.673010715652705,-15.989240177483577,-18.525677038239241,-20.457188143866858,-20.128708880570006,-20.306458000231665,-20.019402679430137,-21.696821479306212,-24.701802933881179,-28.211712558021386,-31.981795789170366,-33.67995947377549,-36.335505983848279,-36.101465571807999,-34.309906430357287,-32.664043237970553,-28.536155140848518,-21.502347398930027,-13.027983638582,-4.9887448943810142]
["MPC-R-S625160","k2","MPC-R-S625160k2",5.1902757360873268,7.4089957249480998,8.6029494253677079,8.4911821814361588,7.7930414723366264,8.63181560565436,9.1539178732256801,9.5065829464913225,9.7330117967489915,9.9074050099672899,9.9913590522670592,9.6838038738562879,9.2618757659102808,8.4827547606168618,7.9546883739224485,7.560490639565419,7.3203628143466055,7.0759745729623678,6.7999645637282002,6.3666707167048422,6.0437905397699385]
["MPC-R-S625160","k3","MPC-R-S625160k3",39.804674607877594,40.276102216443675,40.198845992484713,44.803848535910049,47.697390423808734,47.925552679226058,48.778346049569421,48.597298617378819,51.943147259404988,57.705715202003326,64.316789588796723,71.020085509560488,73.75598655781836,77.914971116451341,76.951543985060439,73.225609654449968,69.924731275184101,62.003953790662621,48.647635572387848,32.455121721326314,17.182249411189499]
["MPC-R-S625160","k4","MPC-R-S625160k4",-7.0590525573306238,-6.6520609878427415,-6.3559903410608465,-7.4542272684295225,-8.2905447279029669,-8.1483120751895495,-8.2252698646650355,-8.1009779759635876,-8.8272689854925854,-10.128376494240173,-11.648108555332726,-13.280497300357197,-14.015779985943237,-15.165595030553883,-15.064263907761379,-14.28855225519748,-13.575922548709844,-11.788613255953054,-8.7430901255284894,-5.0738322773442963,-1.5929792764950774]
["MPC-R-S625200","k1","MPC-R-S625200k1",-12.507515497505601,-12.515011220721719,-12.707254894612992,-13.905474406599417,-15.184042593168082,-15.656973512157707,-17.139543045165535,-17.392359737097589,-19.219781634333973,-21.957336534980499,-24.408973398668856,-26.636290805409896,-29.584878445954981,-25.728868461342735,-23.452529697564483,-23.208765364497545,-20.002496356015516,-15.606281815473697,-8.7484822512110352,-2.8342161744059866,1.9455452912366482]
["MPC-R-S625200","k2","MPC-R-S625200k2",6.7166053753450585,7.7107702654246166,8.9125154898799277,9.3981175328583113,9.0953825303880436,10.13484364337299,10.547260333393655,11.239393811336631,12.060204223686165,12.67800267814023,12.926144889703769,12.816212411324337,12.650191990543913,11.284647150818405,10.558217128961838,9.9955400644549233,9.3629408055453229,8.4497919324715891,7.3601292875510103,6.3676251630790279,5.6851784482015297]
["MPC-R-S625200","k3","MPC-R-S625200k3",34.454671169605184,35.464463522578733,37.061253216010705,40.007410270646446,42.330027836838404,44.340861566902142,47.797703318700854,49.009138620531225,53.582596147250051,59.821866560034543,65.104290296312129,69.567926985449077,75.456530870092337,66.17268397818475,60.771818997324239,59.708460677690695,52.491920882417318,42.55131575398385,27.379503852153515,14.242358896756947,3.7448855728736223]
["MPC-R-S625200","k4","MPC-R-S625200k4",-6.3471546382530359,-6.3512256767027546,-6.455787544016661,-7.1075367479221576,-7.8029947877694266,-8.0602313867313349,-8.8666493337416146,-9.0041608147106214,-9.9981527260791143,-11.487196102194233,-12.820724147575191,-14.032237421285265,-15.636075299547981,-13.538669097659591,-12.300493645324458,-12.16790711850528,-10.423912183286168,-8.0326681813789182,-4.3024856782457217,-1.0855203873922352,1.5143573354093336]
["MPC-R-S625225","k1","MPC-R-S625225k1",-2.7513771255384953,-6.3832917759324879,-8.2385543581383516,-8.6218173884247822,-9.1624040818747474,-9.6364868028796646,-11.49675227030318,-12.557046514947279,-14.321711528966034,-16.269292654295313,-17.70608466585869,-20.025770505515943,-20.432190252603768,-16.03251948210751,-13.055419183106046,-12.392819494218594,-9.4662147023008067,-5.9978783382806586,-1.438141658246197,1.625575041708146,3.3998474579160929]
["MPC-R-S625225","k2","MPC-R-S625225k2",7.5027423513874707,10.040987910427871,11.41617642959827,12.328504345679512,12.40246483270561,13.871741529973034,15.082631202527665,16.342586784155589,18.257008838561163,19.579320041182566,20.168646718330596,21.101634614993905,20.689038120978964,17.220686937328306,15.057631126111296,14.018441269135415,12.051565701794638,9.8288680396567187,7.2341446953519633,5.3257946387096018,4.1743166425276925]
["MPC-R-S625225","k3","MPC-R-S625225k3",15.933936874470126,26.634165773931016,32.178693650016193,33.952422443204561,35.241198302147289,37.776058445965162,43.167489216568903,46.810329574003383,52.690557881128171,58.389654560811543,62.207834495196821,68.353718408162919,68.854364169789704,55.498582305725691,46.645092426956289,44.116781909425669,35.572958769635363,25.555916733410591,12.714210816977202,3.9208401929512191,-1.2179378197920143]
["MPC-R-S625225","k4","MPC-R-S625225k4",-2.9755208736291729,-6.8244347817407371,-8.7905456830336934,-9.19670806055775,-9.7695940524159344,-10.272003803071282,-12.243415280403564,-13.367060567998095,-15.237160415170612,-17.301104694026606,-18.823743165557676,-21.282021910773672,-21.712722768927101,-17.050182011563436,-13.89520628651859,-13.19301814575706,-10.091555341009853,-6.4159934732181432,-1.5838230360959831,1.6629427947284265,3.5432216258076226]
["MPC-R-S625250","k1","MPC-R-S625250k1",-2.7513771255384953,-6.3832917759324879,-8.2385543581383516,-8.6218173884247822,-9.1624040818747474,-9.6364868028796646,-11.49675227030318,-12.557046514947279,-14.321711528966034,-16.269292654295313,-17.70608466585869,-20.025770505515943,-20.432190252603768,-16.03251948210751,-13.055419183106046,-12.392819494218594,-9.4662147023008067,-5.9978783382806586,-1.438141658246197,1.625575041708146,3.3998474579160929]
["MPC-R-S625250","k2","MPC-R-S625250k2",7.5027423513874707,10.040987910427871,11.41617642959827,12.328504345679512,12.40246483270561,13.871741529973034,15.082631202527665,16.342586784155589,18.257008838561163,19.579320041182566,20.168646718330596,21.101634614993905,20.689038120978964,17.220686937328306,15.057631126111296,14.018441269135415,12.051565701794638,9.8288680396567187,7.2341446953519633,5.3257946387096018,4.1743166425276925]
["MPC-R-S625250","k3","MPC-R-S625250k3",15.933936874470126,26.634165773931016,32.178693650016193,33.952422443204561,35.241198302147289,37.776058445965162,43.167489216568903,46.810329574003383,52.690557881128171,58.389654560811543,62.207834495196821,68.353718408162919,68.854364169789704,55.498582305725691,46.645092426956289,44.116781909425669,35.572958769635363,25.555916733410591,12.714210816977202,3.9208401929512191,-1.2179378197920143]
["MPC-R-S625250","k4","MPC-R-S625250k4",-2.9755208736291729,-6.8244347817407371,-8.7905456830336934,-9.19670806055775,-9.7695940524159344,-10.272003803071282,-12.243415280403564,-13.367060567998095,-15.237160415170612,-17.301104694026606,-18.823743165557676,-21.282021910773672,-21.712722768927101,-17.050182011563436,-13.89520628651859,-13.19301814575706,-10.091555341009853,-6.4159934732181432,-1.5838230360959831,1.6629427947284265,3.5432216258076226]
["MPC-V300100","k1","MPC-V300100k1",-26.268046285420859,-30.214923449515464,-21.433150858535598,-15.415631522259702,-10.461464281147578,-17.817937827755262,-21.486487750283491,-24.510863917047583,-29.474255783273538,-30.894080275244843,-35.855283181579914,-41.463025205849121,-46.681721610843859,-50.503762704033839,-50.109938678572817,-44.669248032532622,-34.531534619258892,-21.45266621486989,-8.6733356252559908,1.0950002996911641,6.8081647847403781]
["MPC-V300100","k2","MPC-V300100k2",5.7390406468989452,7.5355082062227838,8.7893835929375079,10.279374313808203,12.20530087919057,11.564241086847844,11.473475547275712,10.925371458225008,10.702112702436107,12.026765056896556,12.090678216728472,11.176720680844646,10.48137171575021,9.8264400501444147,9.2407281086164765,8.4420940236564714,7.4291917129519476,6.5568990991923064,5.9222989085488269,5.5385082668732553,5.5010010232013142,"Messdatum:","2012-10-02"]
["MPC-V300100","k3","MPC-V300100k3",45.316757524361471,52.842119203990812,41.350714592509327,34.107469861185855,28.843611122431248,38.879346500336901,44.112988861310491,47.954225287879495,54.934637366188362,58.3203629435992,65.584851694928844,72.809567644804957,79.688309921783613,84.580410476066604,83.422952299779652,74.727615971261926,59.000790298998403,39.145919531595922,19.963553229720393,5.4021462354452803,-2.9274207181980105]
["MPC-V300100","k4","MPC-V300100k4",-8.3265038056066256,-9.6764444146595885,-6.6727777516455591,-4.6145755396198007,-2.9200707911319044,-5.4362300649686359,-6.6909941188585673,-7.725434591474265,-9.4230783900167054,-9.9086907479198914,-11.605583761834096,-13.523624805536366,-15.308599460335897,-16.615870284236859,-16.481175946607372,-14.620290799694477,-11.152867265621605,-6.6794762070494116,-2.3085338369081141,1.0325536494026224,2.9866616493760154]
["MPC-V300125","k1","MPC-V300125k1",-3.4947775361460911,-9.9140443930600366,-13.066676851281562,-10.40296043265273,-7.6402182040078932,-12.579593214843269,-17.302718882589524,-22.009875984130534,-24.137506427858678,-27.450109706609634,-30.728087213822366,-35.713432898176393,-38.501475112501637,-36.98037959557994,-33.178237673606922,-26.431054681550012,-17.260624208423295,-8.1701076931169503,1.427631698583876,5.5110833607402165,7.0446990385745165]
["MPC-V300125","k2","MPC-V300125k2",4.8697193756532098,7.3154621411812704,9.6104142350600874,11.298783030826975,12.296071991806356,12.94228322543311,13.41540980124666,13.652126497292526,13.292898208865685,14.623901820904562,15.026976206284704,14.404321902405595,13.860174283130007,12.77968218687287,11.813171449680288,10.359107687354019,8.5192455540730219,6.9517778089655193,5.4269803673568973,4.990470518479504,5.1296990335554238,"Messdatum:","2012-10-02"]
["MPC-V300125","k3","MPC-V300125k3",12.26549718058855,25.272620239807413,32.754775427107624,30.06122251599302,26.513554899729872,35.286046827629427,43.529787359790973,51.510474075846012,54.651476358595083,61.432590499715118,67.228597815331639,74.807531840173141,78.85005826321806,75.266846741581688,68.044944669057131,55.490274891342615,38.563054924739411,22.039770593369767,4.7246598058164535,-2.4297152412002965,-4.8138554656378618]
["MPC-V300125","k4","MPC-V300125k4",-1.1596948042196855,-4.2441291200654536,-5.7589336426811819,-4.4790192281880357,-3.1515127300862589,-5.5248766682965984,-7.7942895071269165,-10.056126166519253,-11.078454922237196,-12.670148076057563,-14.245216225099202,-16.640671882449727,-17.980333753806885,-17.249456435086515,-15.422537355809702,-12.180529840260249,-7.7741547920990319,-3.4061726714472518,1.2055352888955397,3.1676929544443526,3.9045624085519295]
["MPC-V300160","k1","MPC-V300160k1",-6.4724202236341091,-6.8918788915366482,-9.0562053528108759,-7.2533082139699863,-2.6259193700854269,-6.1876158930878553,-9.8868903924638438,-15.876278405806209,-17.252063881246364,-19.930794957301362,-22.055492848698844,-24.910015948926134,-26.023665128179491,-24.023351402399534,-20.715445977686539,-15.666694024035252,-8.5360214137784638,-2.2596833789770892,2.9021644799510979,5.0144954812603748,5.6972099996331744]
["MPC-V300160","k2","MPC-V300160k2",7.2271278545398276,9.393605415189537,10.946333261027519,12.460665853097401,12.442923353668384,13.126012940504577,15.526299771444247,17.763037914738433,17.30142365854255,18.764954436652076,19.411935693191143,19.212257760869235,18.523783132133374,16.98946666601087,15.372212965016283,12.912998459433794,9.528003258311708,6.8701410317802862,4.9473379807982054,4.3363119094331406,4.5013205828939773,"Messdatum:","2012-10-02"]
["MPC-V300160","k3","MPC-V300160k3",21.123793471557015,24.070646215354742,29.648347001105133,27.810332494798065,19.187646934318337,26.494062959975633,35.773804907529303,49.148590918159378,51.245261050068521,57.690313180868202,62.288428224481173,67.396886406427839,68.77920372704682,63.524914969038711,55.756114576375388,43.907993251598718,27.262463643543917,12.932880043842161,1.4109433927152226,-3.1282361766555113,-4.2327755997795515]
["MPC-V300160","k4","MPC-V300160k4",-4.5088499116558589,-4.8180746411780691,-6.4136719252072538,-5.0845133450814313,-1.6730612763519874,-4.2988483730663214,-7.026051720963614,-11.441596113100925,-12.455870352393227,-14.430702098442797,-15.997088803234249,-18.101529394295426,-18.922548449977942,-17.447865285630353,-15.009188777519043,-11.28711121488127,-6.0301860132572465,-1.4030949396048347,2.4023742939760582,3.9596553283225764,4.4629756337697213]
["MPC-V400125","k1","MPC-V400125k1"]
["MPC-V400125","k2","MPC-V400125k2"]
["MPC-V400125","k3","MPC-V400125k3"]
["MPC-V400125","k4","MPC-V400125k4"]
["MPC-V400160","k1","MPC-V400160k1"]
["MPC-V400160","k2","MPC-V400160k2"]
["MPC-V400160","k3","MPC-V400160k3"]
["MPC-V400160","k4","MPC-V400160k4"]
["MPC-V400200","k1","MPC-V400200k1"]
["MPC-V400200","k2","MPC-V400200k2"]
["MPC-V400200","k3","MPC-V400200k3"]
["MPC-V400200","k4","MPC-V400200k4"]
["MPC-V400225","k1","MPC-V400225k1"]
["MPC-V400225","k2","MPC-V400225k2"]
["MPC-V400225","k3","MPC-V400225k3"]
["MPC-V400225","k4","MPC-V400225k4"]
["MPC-V400250","k1","MPC-V400250k1"]
["MPC-V400250","k2","MPC-V400250k2"]
["MPC-V400250","k3","MPC-V400250k3"]
["MPC-V400250","k4","MPC-V400250k4"]
["MPC-V500125","k1","MPC-V500125k1"]
["MPC-V500125","k2","MPC-V500125k2"]
["MPC-V500125","k3","MPC-V500125k3"]
["MPC-V500125","k4","MPC-V500125k4"]
["MPC-V500160","k1","MPC-V500160k1"]
["MPC-V500160","k2","MPC-V500160k2"]
["MPC-V500160","k3","MPC-V500160k3"]
["MPC-V500160","k4","MPC-V500160k4"]
["MPC-V500200","k1","MPC-V500200k1"]
["MPC-V500200","k2","MPC-V500200k2"]
["MPC-V500200","k3","MPC-V500200k3"]
["MPC-V500200","k4","MPC-V500200k4"]
["MPC-V500225","k1","MPC-V500225k1"]
["MPC-V500225","k2","MPC-V500225k2"]
["MPC-V500225","k3","MPC-V500225k3"]
["MPC-V500225","k4","MPC-V500225k4"]
["MPC-V500250","k1",{"$f":"CONCATENATE(A452,B452)","v":"MPC-V500250k1"}]
["MPC-V500250","k2","MPC-V500250k2"]
["MPC-V500250","k3","MPC-V500250k3"]
["MPC-V500250","k4","MPC-V500250k4"]
["MPC-V600125","k1","MPC-V600125k1",-22.982954920237038,-24.78741033241306,-21.396372062697715,-19.238463887351557,-22.878323566331783,-26.784473433301038,-27.034549945883402,-33.290021916637421,-36.758943046411531,-38.808813877291755,-40.416443396879451,-41.69800147219857,-42.095324238264801,-43.107679941786131,-43.499007155223744,-41.584736103132116,-37.136131061296439,-32.142383622876089,-24.522363906447186,-12.423676405839171,-3.0525133017538995]
["MPC-V600125","k2","MPC-V600125k2",2.5568832870673428,4.2043001800478947,6.0046193955104945,6.3113244912732727,4.9524552325103173,5.1254265864312512,6.1045145868014785,5.0518551752047749,4.3723059029523696,4.0565477805478061,3.4475650367297037,3.0233346969656338,2.7996654383253432,2.5491598876392128,2.5896954700750037,2.5699620479362024,2.6361714590959031,3.1424371995293399,3.5470861542198961,4.2447800166902745,4.9690232730263499,"Messdatum:","2012-10-04"]
["MPC-V600125","k3","MPC-V600125k3",42.015351760387169,46.632036578436015,42.853876977205815,39.61041030273239,44.239530554996591,50.839108576409124,52.22994731631367,61.468715022372898,66.496152616919147,69.552840781902148,71.588608454269959,73.272736954334334,73.702695705958092,75.117667097863503,75.802064916068176,72.632869881885043,65.380078570953629,57.670558382217195,45.538557481558975,26.331234684547987,11.638004272784993]
["MPC-V600125","k4","MPC-V600125k4",-5.0768941262518448,-5.5341013679837889,-4.6748503017385428,-4.1280666132135666,-5.0503625748279459,-6.0401207073065706,-6.1034778533802427,-7.6885293777013306,-8.5675066215655367,-9.0869155893542661,-9.4942703035885341,-9.8190021292427367,-9.9196793153538145,-10.176195873967433,-10.275353526503404,-9.7903052824381049,-8.6630970266891723,-7.3977504666907921,-5.4669488216432045,-2.4013189041973559,-2.6808657457329535E-2]
["MPC-V600160","k1","MPC-V600160k1",-15.328820290605158,-20.226680484109245,-13.937403491299028,-12.446508350124683,-18.277679320833521,-23.336884678834021,-23.392913331591597,-29.200014381378239,-33.583703396166641,-36.656317295815207,-38.945046820526485,-40.045325511333637,-39.580796377745827,-37.573408011051008,-34.390702320440376,-27.456032974270901,-19.768999028411326,-10.9500703291228,-2.6319206544375384,3.5732273467203668,6.1503917391128207]
["MPC-V600160","k2","MPC-V600160k2",3.9023254518873438,5.0667442778217007,6.8390768463797205,7.4374183191839309,6.2485475240580648,6.3365999412966483,7.4177451824092149,6.5618831864543878,5.6461690739389239,5.3635264306128603,4.5694949081069014,4.0038055947163782,3.5535761040787177,3.4064027678135647,3.4923370540625038,3.6041960193625373,3.7260985955336419,4.1966017897950474,4.7020792066923445,5.1615937371038445,5.4897050786257555,"Messdatum:","2012-10-16"]
["MPC-V600160","k3","MPC-V600160k3",34.269748047712568,44.54296064115519,34.620224052578237,32.446294381641728,42.100813619593318,51.597238425765788,52.783042285507861,62.725985800423963,69.962022747748108,75.393265802769321,78.855169189657346,80.335408168745744,79.021128722903327,75.140844067607304,69.308075832169067,56.523897438014131,42.350630163001107,26.421216938764474,11.458124272598273,0.37840165592657582,-4.0860280283896229]
["MPC-V600160","k4","MPC-V600160k4",-3.9261919904476059,-5.4038146997802086,-3.5063905319579538,-3.0565985593064533,-4.8158098249841439,-6.3421178231815585,-6.359011023246091,-8.1109612063792458,-9.4334846603933595,-10.360464674319548,-11.050960538319707,-11.382911024326678,-11.242771650413586,-10.637163624432302,-9.6769721633749075,-7.5848519360050677,-5.2657504624355411,-2.605166893365241,-9.5668383435924917E-2,1.7763694320407395,2.5538821680709543]
["MPC-Q300-/-225","k1","MPC-Q300-/-225k1"]
["MPC-Q300-/-225","k2","MPC-Q300-/-225k2"]
["MPC-Q300-/-225","k3","MPC-Q300-/-225k3"]
["MPC-Q300-/-225","k4","MPC-Q300-/-225k4"]
["MPC-V600200","k1","MPC-V600200k1",-6.9823826288699475,-7.9563710272672985,-7.4556047535520236,-8.9207902061217936,-11.619613184792087,-19.019059137585408,-19.629320074892796,-23.987012432052953,-27.395928311247769,-28.915458124160715,-28.029209109368299,-28.217983021294536,-24.377357723225042,-15.985350541997741,-11.21423394660648,-8.0251197341288432,-2.2177074446262521,1.1463800458942002,3.5219501906454287,5.202872368005429,5.7992723706856113]
["MPC-V600200","k2","MPC-V600200k2",5.7006146735954566,6.5298502867673127,7.7407026057835058,8.8358673356519759,8.6179525978348792,9.549828570284669,10.171416626343207,9.9636507898336131,9.4360540351075901,9.5842153812875317,8.5939697409359823,7.7950831899316517,6.9397881591699209,6.2049733753654843,5.7301811148757773,5.1206641892040672,4.6293564174240185,4.4451736591765192,4.5866678754771204,4.6992163700522571,5.0303369941231928,"Messdatum:","2012-10-17"]
["MPC-V600200","k3","MPC-V600200k3",22.093704509798787,24.923244635137838,25.106218781942413,29.210404536142367,34.535152194844343,50.660527432068562,52.535465216498309,61.27574638019037,67.747876023059248,71.016309615216727,68.205884208427307,67.794348412590182,59.052362602851126,41.085031331798433,30.813001910042061,23.65470700461842,11.238242914115576,4.1460885826975371,-0.5904486883924791,-3.9295426051909335,-4.8229767536319477]
["MPC-V600200","k4","MPC-V600200k4",-3.3176364447513755,-3.8444603097586234,-3.5735883693139399,-4.3661022697010807,-5.8257192376816427,-9.8282696895481525,-10.158348314917367,-12.515444700171219,-14.35934390444795,-15.181260461201662,-14.701896086697007,-14.804011796807378,-12.726615187511063,-8.1873615972601854,-5.6066562094413284,-3.8816616902432219,-0.74042176311271679,1.0792220599894016,2.3641863703904122,3.2734103385705393,3.5960100730939866]
["MPC-V600225","k1","MPC-V600225k1",-3.551443362839164,-6.2360133365024604,-3.8349712984388002,-3.4851227700371492,-5.9547849094371648,-14.313675868647115,-17.95714070845041,-19.260809673448321,-21.652706794601599,-22.192492590276512,-19.890523033248506,-19.680094294220272,-17.27757529964488,-9.9689459711269812,-6.3464532058307892,-3.8933908968178335,0.33755261336399989,2.9380102843937963,4.2244854611810796,4.6656552815457752,4.9493080309289086]
["MPC-V600225","k2","MPC-V600225k2",5.9689048303783609,7.7006918865082445,8.2132292700605305,8.8962452757182326,9.9369039702620192,13.021137502962654,14.430508961358676,13.817788573373774,13.831138610073236,14.066801318036985,12.599898780742139,11.624992300808882,10.330938408901005,8.1641964480689779,6.9657598584646072,5.6970224325973362,4.493760723836596,3.8459326070714384,3.9540390119485211,4.1217218294792337,4.4376517929695636]
["MPC-V600225","k3","MPC-V600225k3",16.198413014528146,23.963418154279232,19.080456877833335,18.97746502294547,25.568222692975134,47.437373140421805,57.034713148023343,59.351441552349272,64.739878818637024,66.188606727916138,59.548334461119133,58.100302823151466,51.406967090245281,32.815697518190298,23.476477393322771,16.694885022781598,5.9835287088154976,-0.50825453789831043,-3.2911277616542947,-4.1148115309931717,-4.4362302909432829]
["MPC-V600225","k4","MPC-V600225k4",-2.4918064603350132,-4.5513818974269693,-2.7093172417604072,-2.4409128063829382,-4.3356151228991919,-10.748480961616643,-13.543715555202342,-14.543882307640875,-16.378927133466604,-16.793045738340279,-15.026999011732832,-14.865563477482651,-13.022374234156695,-7.41525895296654,-4.636113579026838,-2.7541473894109254,0.49179673264865992,2.48685648244791,3.4738365984616562,3.8123014215739657,4.0299203191469601]
["MPC-V600250","k1","MPC-V600250k1",-3.551443362839164,-6.2360133365024604,-3.8349712984388002,-3.4851227700371492,-5.9547849094371648,-14.313675868647115,-17.95714070845041,-19.260809673448321,-21.652706794601599,-22.192492590276512,-19.890523033248506,-19.680094294220272,-17.27757529964488,-9.9689459711269812,-6.3464532058307892,-3.8933908968178335,0.33755261336399989,2.9380102843937963,4.2244854611810796,4.6656552815457752,4.9493080309289086]
["MPC-V600250","k2","MPC-V600250k2",5.9689048303783609,7.7006918865082445,8.2132292700605305,8.8962452757182326,9.9369039702620192,13.021137502962654,14.430508961358676,13.817788573373774,13.831138610073236,14.066801318036985,12.599898780742139,11.624992300808882,10.330938408901005,8.1641964480689779,6.9657598584646072,5.6970224325973362,4.493760723836596,3.8459326070714384,3.9540390119485211,4.1217218294792337,4.4376517929695636,"Messdatum:","2012-10-17"]
["MPC-V600250","k3","MPC-V600250k3",16.198413014528146,23.963418154279232,19.080456877833335,18.97746502294547,25.568222692975134,47.437373140421805,57.034713148023343,59.351441552349272,64.739878818637024,66.188606727916138,59.548334461119133,58.100302823151466,51.406967090245281,32.815697518190298,23.476477393322771,16.694885022781598,5.9835287088154976,-0.50825453789831043,-3.2911277616542947,-4.1148115309931717,-4.4362302909432829]
["MPC-V600250","k4","MPC-V600250k4",-2.4918064603350132,-4.5513818974269693,-2.7093172417604072,-2.4409128063829382,-4.3356151228991919,-10.748480961616643,-13.543715555202342,-14.543882307640875,-16.378927133466604,-16.793045738340279,-15.026999011732832,-14.865563477482651,-13.022374234156695,-7.41525895296654,-4.636113579026838,-2.7541473894109254,0.49179673264865992,2.48685648244791,3.4738365984616562,3.8123014215739657,4.0299203191469601]
["MPC-V625125","k1","MPC-V625125k1",-22.982954920237038,-24.78741033241306,-21.396372062697715,-19.238463887351557,-22.878323566331783,-26.784473433301038,-27.034549945883402,-33.290021916637421,-36.758943046411531,-38.808813877291755,-40.416443396879451,-41.69800147219857,-42.095324238264801,-43.107679941786131,-43.499007155223744,-41.584736103132116,-37.136131061296439,-32.142383622876089,-24.522363906447186,-12.423676405839171,-3.0525133017538995]
["MPC-V625125","k2","MPC-V625125k2",2.5568832870673428,4.2043001800478947,6.0046193955104945,6.3113244912732727,4.9524552325103173,5.1254265864312512,6.1045145868014785,5.0518551752047749,4.3723059029523696,4.0565477805478061,3.4475650367297037,3.0233346969656338,2.7996654383253432,2.5491598876392128,2.5896954700750037,2.5699620479362024,2.6361714590959031,3.1424371995293399,3.5470861542198961,4.2447800166902745,4.9690232730263499]
["MPC-V625125","k3","MPC-V625125k3",42.015351760387169,46.632036578436015,42.853876977205815,39.61041030273239,44.239530554996591,50.839108576409124,52.22994731631367,61.468715022372898,66.496152616919147,69.552840781902148,71.588608454269959,73.272736954334334,73.702695705958092,75.117667097863503,75.802064916068176,72.632869881885043,65.380078570953629,57.670558382217195,45.538557481558975,26.331234684547987,11.638004272784993]
["MPC-V625125","k4","MPC-V625125k4",-5.0768941262518448,-5.5341013679837889,-4.6748503017385428,-4.1280666132135666,-5.0503625748279459,-6.0401207073065706,-6.1034778533802427,-7.6885293777013306,-8.5675066215655367,-9.0869155893542661,-9.4942703035885341,-9.8190021292427367,-9.9196793153538145,-10.176195873967433,-10.275353526503404,-9.7903052824381049,-8.6630970266891723,-7.3977504666907921,-5.4669488216432045,-2.4013189041973559,-2.6808657457329535E-2]
["MPC-Q300-/-250","k1","MPC-Q300-/-250k1"]
["MPC-Q300-/-250","k2","MPC-Q300-/-250k2"]
["MPC-Q300-/-250","k3","MPC-Q300-/-250k3"]
["MPC-Q300-/-250","k4","MPC-Q300-/-250k4"]
["MPC-V625160","k1","MPC-V625160k1",-15.328820290605158,-20.226680484109245,-13.937403491299028,-12.446508350124683,-18.277679320833521,-23.336884678834021,-23.392913331591597,-29.200014381378239,-33.583703396166641,-36.656317295815207,-38.945046820526485,-40.045325511333637,-39.580796377745827,-37.573408011051008,-34.390702320440376,-27.456032974270901,-19.768999028411326,-10.9500703291228,-2.6319206544375384,3.5732273467203668,6.1503917391128207]
["MPC-V625160","k2","MPC-V625160k2",3.9023254518873438,5.0667442778217007,6.8390768463797205,7.4374183191839309,6.2485475240580648,6.3365999412966483,7.4177451824092149,6.5618831864543878,5.6461690739389239,5.3635264306128603,4.5694949081069014,4.0038055947163782,3.5535761040787177,3.4064027678135647,3.4923370540625038,3.6041960193625373,3.7260985955336419,4.1966017897950474,4.7020792066923445,5.1615937371038445,5.4897050786257555]
["MPC-V625160","k3","MPC-V625160k3",34.269748047712568,44.54296064115519,34.620224052578237,32.446294381641728,42.100813619593318,51.597238425765788,52.783042285507861,62.725985800423963,69.962022747748108,75.393265802769321,78.855169189657346,80.335408168745744,79.021128722903327,75.140844067607304,69.308075832169067,56.523897438014131,42.350630163001107,26.421216938764474,11.458124272598273,0.37840165592657582,-4.0860280283896229]
["MPC-V625160","k4","MPC-V625160k4",-3.9261919904476059,-5.4038146997802086,-3.5063905319579538,-3.0565985593064533,-4.8158098249841439,-6.3421178231815585,-6.359011023246091,-8.1109612063792458,-9.4334846603933595,-10.360464674319548,-11.050960538319707,-11.382911024326678,-11.242771650413586,-10.637163624432302,-9.6769721633749075,-7.5848519360050677,-5.2657504624355411,-2.605166893365241,-9.5668383435924917E-2,1.7763694320407395,2.5538821680709543]
["MPC-V625200","k1","MPC-V625200k1",-6.9823826288699475,-7.9563710272672985,-7.4556047535520236,-8.9207902061217936,-11.619613184792087,-19.019059137585408,-19.629320074892796,-23.987012432052953,-27.395928311247769,-28.915458124160715,-28.029209109368299,-28.217983021294536,-24.377357723225042,-15.985350541997741,-11.21423394660648,-8.0251197341288432,-2.2177074446262521,1.1463800458942002,3.5219501906454287,5.202872368005429,5.7992723706856113]
["MPC-V625200","k2","MPC-V625200k2",5.7006146735954566,6.5298502867673127,7.7407026057835058,8.8358673356519759,8.6179525978348792,9.549828570284669,10.171416626343207,9.9636507898336131,9.4360540351075901,9.5842153812875317,8.5939697409359823,7.7950831899316517,6.9397881591699209,6.2049733753654843,5.7301811148757773,5.1206641892040672,4.6293564174240185,4.4451736591765192,4.5866678754771204,4.6992163700522571,5.0303369941231928]
["MPC-V625200","k3","MPC-V625200k3",22.093704509798787,24.923244635137838,25.106218781942413,29.210404536142367,34.535152194844343,50.660527432068562,52.535465216498309,61.27574638019037,67.747876023059248,71.016309615216727,68.205884208427307,67.794348412590182,59.052362602851126,41.085031331798433,30.813001910042061,23.65470700461842,11.238242914115576,4.1460885826975371,-0.5904486883924791,-3.9295426051909335,-4.8229767536319477]
["MPC-V625200","k4","MPC-V625200k4",-3.3176364447513755,-3.8444603097586234,-3.5735883693139399,-4.3661022697010807,-5.8257192376816427,-9.8282696895481525,-10.158348314917367,-12.515444700171219,-14.35934390444795,-15.181260461201662,-14.701896086697007,-14.804011796807378,-12.726615187511063,-8.1873615972601854,-5.6066562094413284,-3.8816616902432219,-0.74042176311271679,1.0792220599894016,2.3641863703904122,3.2734103385705393,3.5960100730939866]
["MPC-V625225","k1","MPC-V625225k1",-3.551443362839164,-6.2360133365024604,-3.8349712984388002,-3.4851227700371492,-5.9547849094371648,-14.313675868647115,-17.95714070845041,-19.260809673448321,-21.652706794601599,-22.192492590276512,-19.890523033248506,-19.680094294220272,-17.27757529964488,-9.9689459711269812,-6.3464532058307892,-3.8933908968178335,0.33755261336399989,2.9380102843937963,4.2244854611810796,4.6656552815457752,4.9493080309289086]
["MPC-V625225","k2","MPC-V625225k2",5.9689048303783609,7.7006918865082445,8.2132292700605305,8.8962452757182326,9.9369039702620192,13.021137502962654,14.430508961358676,13.817788573373774,13.831138610073236,14.066801318036985,12.599898780742139,11.624992300808882,10.330938408901005,8.1641964480689779,6.9657598584646072,5.6970224325973362,4.493760723836596,3.8459326070714384,3.9540390119485211,4.1217218294792337,4.4376517929695636]
["MPC-V625225","k3","MPC-V625225k3",16.198413014528146,23.963418154279232,19.080456877833335,18.97746502294547,25.568222692975134,47.437373140421805,57.034713148023343,59.351441552349272,64.739878818637024,66.188606727916138,59.548334461119133,58.100302823151466,51.406967090245281,32.815697518190298,23.476477393322771,16.694885022781598,5.9835287088154976,-0.50825453789831043,-3.2911277616542947,-4.1148115309931717,-4.4362302909432829]
["MPC-V625225","k4","MPC-V625225k4",-2.4918064603350132,-4.5513818974269693,-2.7093172417604072,-2.4409128063829382,-4.3356151228991919,-10.748480961616643,-13.543715555202342,-14.543882307640875,-16.378927133466604,-16.793045738340279,-15.026999011732832,-14.865563477482651,-13.022374234156695,-7.41525895296654,-4.636113579026838,-2.7541473894109254,0.49179673264865992,2.48685648244791,3.4738365984616562,3.8123014215739657,4.0299203191469601]
["MPC-V625250","k1","MPC-V625250k1",-3.551443362839164,-6.2360133365024604,-3.8349712984388002,-3.4851227700371492,-5.9547849094371648,-14.313675868647115,-17.95714070845041,-19.260809673448321,-21.652706794601599,-22.192492590276512,-19.890523033248506,-19.680094294220272,-17.27757529964488,-9.9689459711269812,-6.3464532058307892,-3.8933908968178335,0.33755261336399989,2.9380102843937963,4.2244854611810796,4.6656552815457752,4.9493080309289086]
["MPC-V625250","k2","MPC-V625250k2",5.9689048303783609,7.7006918865082445,8.2132292700605305,8.8962452757182326,9.9369039702620192,13.021137502962654,14.430508961358676,13.817788573373774,13.831138610073236,14.066801318036985,12.599898780742139,11.624992300808882,10.330938408901005,8.1641964480689779,6.9657598584646072,5.6970224325973362,4.493760723836596,3.8459326070714384,3.9540390119485211,4.1217218294792337,4.4376517929695636]
["MPC-V625250","k3","MPC-V625250k3",16.198413014528146,23.963418154279232,19.080456877833335,18.97746502294547,25.568222692975134,47.437373140421805,57.034713148023343,59.351441552349272,64.739878818637024,66.188606727916138,59.548334461119133,58.100302823151466,51.406967090245281,32.815697518190298,23.476477393322771,16.694885022781598,5.9835287088154976,-0.50825453789831043,-3.2911277616542947,-4.1148115309931717,-4.4362302909432829]
["MPC-V625250","k4","MPC-V625250k4",-2.4918064603350132,-4.5513818974269693,-2.7093172417604072,-2.4409128063829382,-4.3356151228991919,-10.748480961616643,-13.543715555202342,-14.543882307640875,-16.378927133466604,-16.793045738340279,-15.026999011732832,-14.865563477482651,-13.022374234156695,-7.41525895296654,-4.636113579026838,-2.7541473894109254,0.49179673264865992,2.48685648244791,3.4738365984616562,3.8123014215739657,4.0299203191469601]
[null,null,null,2,3,4,5,6,7,8,9,10,11,12,13,14,15,16,17,18,19,20,21,22]
["Pfuschzelle DN600",{"$f":"Auslegung!D18","v":600}]
[null,null,null,"ZULUFTSEITE Terzfrequenzband fm [Hz]"]
["Konstantenübergabe",null,null,100,125,160,200,250,315,400,500,630,800,1000,1250,1600,2000,2500,3150,4000,5000,6300,8000,10000]
[{"$f":"CONCATENATE(Auslegung!$D$12,Lw!$B$505,Auslegung!$D$25)","v":"MPC-R-M600250"},"k1",{"$f":"CONCATENATE(A508,B508)","v":"MPC-R-M600250k1"},{"$f":"VLOOKUP($C508,$C$4:$X$503,D$504,FALSE)","v":-4.2313726571972969},{"$f":"VLOOKUP($C508,$C$4:$X$503,E$504,FALSE)","v":-9.897703264408733},-11.462035009818146,-9.3399220593974768,-11.943010106007392,-10.461546102621936,-14.587288593241242,-16.809144890102257,-17.778492629342882,-20.668758220305708,-24.275691169235536,-25.913409681631801,-27.001015374225027,-22.291834501523436,-18.26958782633643,-16.597545406043022,-10.806418197974436,{"$f":"VLOOKUP($C508,$C$4:$X$503,U$504,FALSE)","v":-4.913642688209408},0.32034758312205253,3.182448487138172,4.4492898078158847]
[{"$f":"CONCATENATE(Auslegung!$D$12,Lw!$B$505,Auslegung!$D$25)","v":"MPC-R-M600250"},"k2",{"$f":"CONCATENATE(A509,B509)","v":"MPC-R-M600250k2"},{"$f":"VLOOKUP($C509,$C$4:$X$503,D$504,FALSE)","v":6.7902956438052797},9.4480522271011225,10.379292606381298,10.261074905191098,10.528994559776399,11.242274168326373,12.680915233576618,13.784973700213394,14.807277002895702,15.853379203603566,16.797302729218956,16.646046547114079,16.302527302617172,13.904588511004006,12.15372796192622,11.063955942730658,8.9181019610907359,6.7206288883584682,5.1971781734969378,4.3553597475338082,4.2582518349213467]
[{"$f":"CONCATENATE(Auslegung!$D$12,Lw!$B$505,Auslegung!$D$25)","v":"MPC-R-M600250"},"k3",{"$f":"CONCATENATE(A510,B510)","v":"MPC-R-M600250k3"},18.548453292200993,33.940301851259477,38.387177980582734,33.500206389438958,39.617760178539271,37.002232650746542,47.7125756913562,53.809887298958905,57.010846694245686,64.552201449551958,73.601794341060696,77.130684645941969,79.231051769112298,66.249976775366576,55.459881500439145,50.612361059880399,35.452172809711698,20.011925051716645,6.7263409286674394,-0.54740025355574873,-3.4913658819768476]
[{"$f":"CONCATENATE(Auslegung!$D$12,Lw!$B$505,Auslegung!$D$25)","v":"MPC-R-M600250"},"k4",{"$f":"CONCATENATE(A511,B511)","v":"MPC-R-M600250k4"},-3.7141974647754843,-8.8203712909644487,-10.230056820546039,-8.3177271387292979,-10.663484384724471,-9.3284693305676569,-13.046354686507035,-15.048563575443307,-15.922083875902425,-18.526628677150839,-21.776991866468119,-23.252812645699443,-24.232904078860379,-19.989259342795439,-16.364641426812536,-14.857891838881031,-9.6392577898150158,-4.3290215280766624,0.38755491492090011,2.9667244212597303,4.1083341268864402]
[]
["Schallleistungspegelberechnung",null,"ZULUFT"]
[{"$f":"CONCATENATE(Auslegung!$D$12,Lw!$B$505,Auslegung!$D$25)","v":"MPC-R-M600250"},null,null,{"$f":"IF(D$508+D$509*LOG(Auslegung!$D$32)+Lw!$D510*LOG(Grunddaten!$H$141)+Lw!$D511*LOG(Grunddaten!$F$141)>0,D$508+D$509*LOG(Auslegung!$D$32)+Lw!D$510*LOG(Grunddaten!$H$141)+Lw!D$511*LOG(Grunddaten!$F$141),0)","v":18.904374984265917},{"$f":"IF(E$508+E$509*LOG(Auslegung!$D$32)+Lw!$D510*LOG(Grunddaten!$H$141)+Lw!$D511*LOG(Grunddaten!$F$141)>0,E$508+E$509*LOG(Auslegung!$D$32)+Lw!E$510*LOG(Grunddaten!$H$141)+Lw!E$511*LOG(Grunddaten!$F$141),0)","v":22.603944934197056},{"$f":"IF(F$508+F$509*LOG(Auslegung!$D$32)+Lw!$D510*LOG(Grunddaten!$H$141)+Lw!$D511*LOG(Grunddaten!$F$141)>0,F$508+F$509*LOG(Auslegung!$D$32)+Lw!F$510*LOG(Grunddaten!$H$141)+Lw!F$511*LOG(Grunddaten!$F$141),0)","v":24.244128914222557},{"$f":"IF(G$508+G$509*LOG(Auslegung!$D$32)+Lw!$D510*LOG(Grunddaten!$H$141)+Lw!$D511*LOG(Grunddaten!$F$141)>0,G$508+G$509*LOG(Auslegung!$D$32)+Lw!G$510*LOG(Grunddaten!$H$141)+Lw!G$511*LOG(Grunddaten!$F$141),0)","v":25.60694282696533},{"$f":"IF(H$508+H$509*LOG(Auslegung!$D$32)+Lw!$D510*LOG(Grunddaten!$H$141)+Lw!$D511*LOG(Grunddaten!$F$141)>0,H$508+H$509*LOG(Auslegung!$D$32)+Lw!H$510*LOG(Grunddaten!$H$141)+Lw!H$511*LOG(Grunddaten!$F$141),0)","v":24.320354596036353},{"$f":"IF(I$508+I$509*LOG(Auslegung!$D$32)+Lw!$D510*LOG(Grunddaten!$H$141)+Lw!$D511*LOG(Grunddaten!$F$141)>0,I$508+I$509*LOG(Auslegung!$D$32)+Lw!I$510*LOG(Grunddaten!$H$141)+Lw!I$511*LOG(Grunddaten!$F$141),0)","v":27.765242880228321},{"$f":"IF(J$508+J$509*LOG(Auslegung!$D$32)+Lw!$D510*LOG(Grunddaten!$H$141)+Lw!$D511*LOG(Grunddaten!$F$141)>0,J$508+J$509*LOG(Auslegung!$D$32)+Lw!J$510*LOG(Grunddaten!$H$141)+Lw!J$511*LOG(Grunddaten!$F$141),0)","v":28.90323989847117},{"$f":"IF(K$508+K$509*LOG(Auslegung!$D$32)+Lw!$D510*LOG(Grunddaten!$H$141)+Lw!$D511*LOG(Grunddaten!$F$141)>0,K$508+K$509*LOG(Auslegung!$D$32)+Lw!K$510*LOG(Grunddaten!$H$141)+Lw!K$511*LOG(Grunddaten!$F$141),0)","v":30.547881711775716},{"$f":"IF(L$508+L$509*LOG(Auslegung!$D$32)+Lw!$D510*LOG(Grunddaten!$H$141)+Lw!$D511*LOG(Grunddaten!$F$141)>0,L$508+L$509*LOG(Auslegung!$D$32)+Lw!L$510*LOG(Grunddaten!$H$141)+Lw!L$511*LOG(Grunddaten!$F$141),0)","v":32.959343091020301},{"$f":"IF(M$508+M$509*LOG(Auslegung!$D$32)+Lw!$D510*LOG(Grunddaten!$H$141)+Lw!$D511*LOG(Grunddaten!$F$141)>0,M$508+M$509*LOG(Auslegung!$D$32)+Lw!M$510*LOG(Grunddaten!$H$141)+Lw!M$511*LOG(Grunddaten!$F$141),0)","v":33.876471156433794},{"$f":"IF(N$508+N$509*LOG(Auslegung!$D$32)+Lw!$D510*LOG(Grunddaten!$H$141)+Lw!$D511*LOG(Grunddaten!$F$141)>0,N$508+N$509*LOG(Auslegung!$D$32)+Lw!N$510*LOG(Grunddaten!$H$141)+Lw!N$511*LOG(Grunddaten!$F$141),0)","v":33.888109948934229},{"$f":"IF(O$508+O$509*LOG(Auslegung!$D$32)+Lw!$D510*LOG(Grunddaten!$H$141)+Lw!$D511*LOG(Grunddaten!$F$141)>0,O$508+O$509*LOG(Auslegung!$D$32)+Lw!O$510*LOG(Grunddaten!$H$141)+Lw!O$511*LOG(Grunddaten!$F$141),0)","v":32.076584085319382},{"$f":"IF(P$508+P$509*LOG(Auslegung!$D$32)+Lw!$D510*LOG(Grunddaten!$H$141)+Lw!$D511*LOG(Grunddaten!$F$141)>0,P$508+P$509*LOG(Auslegung!$D$32)+Lw!P$510*LOG(Grunddaten!$H$141)+Lw!P$511*LOG(Grunddaten!$F$141),0)","v":30.111942688338313},{"$f":"IF(Q$508+Q$509*LOG(Auslegung!$D$32)+Lw!$D510*LOG(Grunddaten!$H$141)+Lw!$D511*LOG(Grunddaten!$F$141)>0,Q$508+Q$509*LOG(Auslegung!$D$32)+Lw!Q$510*LOG(Grunddaten!$H$141)+Lw!Q$511*LOG(Grunddaten!$F$141),0)","v":26.444709241232381},{"$f":"IF(R$508+R$509*LOG(Auslegung!$D$32)+Lw!$D510*LOG(Grunddaten!$H$141)+Lw!$D511*LOG(Grunddaten!$F$141)>0,R$508+R$509*LOG(Auslegung!$D$32)+Lw!R$510*LOG(Grunddaten!$H$141)+Lw!R$511*LOG(Grunddaten!$F$141),0)","v":24.243913190762264},{"$f":"IF(S$508+S$509*LOG(Auslegung!$D$32)+Lw!$D510*LOG(Grunddaten!$H$141)+Lw!$D511*LOG(Grunddaten!$F$141)>0,S$508+S$509*LOG(Auslegung!$D$32)+Lw!S$510*LOG(Grunddaten!$H$141)+Lw!S$511*LOG(Grunddaten!$F$141),0)","v":22.194972570014631},{"$f":"IF(T$508+T$509*LOG(Auslegung!$D$32)+Lw!$D510*LOG(Grunddaten!$H$141)+Lw!$D511*LOG(Grunddaten!$F$141)>0,T$508+T$509*LOG(Auslegung!$D$32)+Lw!T$510*LOG(Grunddaten!$H$141)+Lw!T$511*LOG(Grunddaten!$F$141),0)","v":20.201268331098511},{"$f":"IF(U$508+U$509*LOG(Auslegung!$D$32)+Lw!$D510*LOG(Grunddaten!$H$141)+Lw!$D511*LOG(Grunddaten!$F$141)>0,U$508+U$509*LOG(Auslegung!$D$32)+Lw!U$510*LOG(Grunddaten!$H$141)+Lw!U$511*LOG(Grunddaten!$F$141),0)","v":18.128848751267018},{"$f":"IF(V$508+V$509*LOG(Auslegung!$D$32)+Lw!$D510*LOG(Grunddaten!$H$141)+Lw!$D511*LOG(Grunddaten!$F$141)>0,V$508+V$509*LOG(Auslegung!$D$32)+Lw!V$510*LOG(Grunddaten!$H$141)+Lw!V$511*LOG(Grunddaten!$F$141),0)","v":17.630274558528594},{"$f":"IF(W$508+W$509*LOG(Auslegung!$D$32)+Lw!$D510*LOG(Grunddaten!$H$141)+Lw!$D511*LOG(Grunddaten!$F$141)>0,W$508+W$509*LOG(Auslegung!$D$32)+Lw!W$510*LOG(Grunddaten!$H$141)+Lw!W$511*LOG(Grunddaten!$F$141),0)","v":17.330210799799506},{"$f":"IF(X$508+X$509*LOG(Auslegung!$D$32)+Lw!$D510*LOG(Grunddaten!$H$141)+Lw!$D511*LOG(Grunddaten!$F$141)>0,X$508+X$509*LOG(Auslegung!$D$32)+Lw!X$510*LOG(Grunddaten!$H$141)+Lw!X$511*LOG(Grunddaten!$F$141),0)","v":18.060615907522841},{"$f":"10*LOG(10^(0.1*D514)+10^(0.1*E514)+10^(0.1*F514)+10^(0.1*G514)+10^(0.1*H514)+10^(0.1*I514)+10^(0.1*J514)+10^(0.1*K514)+10^(0.1*L514)+10^(0.1*M514)+10^(0.1*N514)+10^(0.1*O514)+10^(0.1*P514)+10^(0.1*Q514)+10^(0.1*R514)+10^(0.1*S514)+10^(0.1*T514)+10^(0.1*U514)+10^(0.1*V514)+10^(0.1*W514)+10^(0.1*X514))","v":41.581280489233833}]
[null,null,null,{"$error":"#REF!"},{"$error":"#REF!"},{"$error":"#REF!"},{"$error":"#REF!"},{"$error":"#REF!"},{"$error":"#REF!"},{"$error":"#REF!"},{"$error":"#REF!"},{"$error":"#REF!"},{"$error":"#REF!"},{"$error":"#REF!"},{"$error":"#REF!"},{"$error":"#REF!"},{"$error":"#REF!"},{"$error":"#REF!"},{"$error":"#REF!"},{"$error":"#REF!"},{"$error":"#REF!"},{"$error":"#REF!"},{"$error":"#REF!"},{"$error":"#REF!"},{"$f":"10*LOG(10^(0.1*D515)+10^(0.1*E515)+10^(0.1*F515)+10^(0.1*G515)+10^(0.1*H515)+10^(0.1*I515)+10^(0.1*J515)+10^(0.1*K515)+10^(0.1*L515)+10^(0.1*M515)+10^(0.1*N515)+10^(0.1*O515)+10^(0.1*P515)+10^(0.1*Q515)+10^(0.1*R515)+10^(0.1*S515)+10^(0.1*T515)+10^(0.1*U515)+10^(0.1*V515)+10^(0.1*W515)+10^(0.1*X515))","v":{"$error":"#REF!"}}]
[null,null,null,{"$error":"#REF!"},{"$error":"#REF!"},{"$error":"#REF!"},{"$error":"#REF!"},{"$error":"#REF!"},{"$error":"#REF!"},{"$error":"#REF!"},{"$error":"#REF!"},{"$error":"#REF!"},{"$error":"#REF!"},{"$error":"#REF!"},{"$error":"#REF!"},{"$error":"#REF!"},{"$error":"#REF!"},{"$error":"#REF!"},{"$error":"#REF!"},{"$error":"#REF!"},{"$error":"#REF!"},{"$error":"#REF!"},{"$error":"#REF!"},{"$error":"#REF!"},{"$f":"10*LOG(10^(0.1*D516)+10^(0.1*E516)+10^(0.1*F516)+10^(0.1*G516)+10^(0.1*H516)+10^(0.1*I516)+10^(0.1*J516)+10^(0.1*K516)+10^(0.1*L516)+10^(0.1*M516)+10^(0.1*N516)+10^(0.1*O516)+10^(0.1*P516)+10^(0.1*Q516)+10^(0.1*R516)+10^(0.1*S516)+10^(0.1*T516)+10^(0.1*U516)+10^(0.1*V516)+10^(0.1*W516)+10^(0.1*X516))","v":{"$error":"#REF!"}}]
[null,null,null,{"$error":"#REF!"},{"$error":"#REF!"},{"$error":"#REF!"},{"$error":"#REF!"},{"$error":"#REF!"},{"$error":"#REF!"},{"$error":"#REF!"},{"$error":"#REF!"},{"$error":"#REF!"},{"$error":"#REF!"},{"$error":"#REF!"},{"$error":"#REF!"},{"$error":"#REF!"},{"$error":"#REF!"},{"$error":"#REF!"},{"$error":"#REF!"},{"$error":"#REF!"},{"$error":"#REF!"},{"$error":"#REF!"},{"$error":"#REF!"},{"$error":"#REF!"},{"$f":"10*LOG(10^(0.1*D517)+10^(0.1*E517)+10^(0.1*F517)+10^(0.1*G517)+10^(0.1*H517)+10^(0.1*I517)+10^(0.1*J517)+10^(0.1*K517)+10^(0.1*L517)+10^(0.1*M517)+10^(0.1*N517)+10^(0.1*O517)+10^(0.1*P517)+10^(0.1*Q517)+10^(0.1*R517)+10^(0.1*S517)+10^(0.1*T517)+10^(0.1*U517)+10^(0.1*V517)+10^(0.1*W517)+10^(0.1*X517))","v":{"$error":"#REF!"}}]
[]
[null,null,null,"ZULUFTSSEITE Oktav-Frequenz fOkt [Hz]",null,null,null,null,null,null,"SLWA ",null,-16.100000000000001,-8.6,-3.2,0,1.2,1,-1.1000000000000001]
["Auswahl:",null,null,125,250,500,1000,2000,4000,8000,"Summe",null,"ZULUFTSSEITE Oktav-Frequenz fOkt [Hz]"]
[{"$f":"A508","v":"MPC-R-M600250"},null,null,{"$f":"10*LOG(10^(0.1*D514)+10^(0.1*E514)+10^(0.1*F514))","v":27.20615244439831},{"$f":"10*LOG(10^(0.1*G514)+10^(0.1*H514)+10^(0.1*I514))","v":30.905519542826937},{"$f":"10*LOG(10^(0.1*J514)+10^(0.1*K514)+10^(0.1*L514))","v":35.897211623437734},{"$f":"10*LOG(10^(0.1*M514)+10^(0.1*N514)+10^(0.1*O514))","v":38.130825576990105},{"$f":"10*LOG(10^(0.1*P514)+10^(0.1*Q514)+10^(0.1*R514))","v":32.387593454255935},{"$f":"10*LOG(10^(0.1*S514)+10^(0.1*T514)+10^(0.1*U514))","v":25.25700115341154},{"$f":"10*LOG(10^(0.1*V514)+10^(0.1*W514)+10^(0.1*X514))","v":22.455303026490384},{"$f":"10*LOG(10^(0.1*D521)+10^(0.1*E521)+10^(0.1*F521)+10^(0.1*G521)+10^(0.1*H521)+10^(0.1*I521)+10^(0.1*J521))","v":41.581280489233833},null,125,250,500,1000,2000,4000,8000]
[{"$f":"A527","v":"MPC-Q600250"},null,null,{"$f":"10*LOG(10^(0.1*D533)+10^(0.1*E533)+10^(0.1*F533))","v":15.47206382817402},{"$f":"10*LOG(10^(0.1*G533)+10^(0.1*H533)+10^(0.1*I533))","v":16.706727271341229},{"$f":"10*LOG(10^(0.1*J533)+10^(0.1*K533)+10^(0.1*L533))","v":16.411258096908455},{"$f":"10*LOG(10^(0.1*M533)+10^(0.1*N533)+10^(0.1*O533))","v":14.988885625157021},{"$f":"10*LOG(10^(0.1*P533)+10^(0.1*Q533)+10^(0.1*R533))","v":13.2067906216982},{"$f":"10*LOG(10^(0.1*S533)+10^(0.1*T533)+10^(0.1*U533))","v":14.311553836257904},{"$f":"10*LOG(10^(0.1*V533)+10^(0.1*W533)+10^(0.1*X533))","v":20.866948583968664},{"$f":"10*LOG(10^(0.1*D522)+10^(0.1*E522)+10^(0.1*F522)+10^(0.1*G522)+10^(0.1*H522)+10^(0.1*I522)+10^(0.1*J522))","v":25.150966509687301},null,{"$f":"D521-M$519","v":43.306152444398307},{"$f":"E521-N$519","v":39.505519542826939},39.097211623437737,38.130825576990105,31.187593454255936,24.25700115341154,23.555303026490385]
[null,null,null,null,null,null,null,null,null,null,null,null,{"$f":"D522-M$519","v":31.572063828174024},{"$f":"E522-N$519","v":25.306727271341231},{"$f":"F522-O$519","v":19.611258096908454},{"$f":"G522-P$519","v":14.988885625157021},{"$f":"H522-Q$519","v":12.006790621698201},{"$f":"I522-R$519","v":13.311553836257904},{"$f":"J522-S$519","v":21.966948583968666}]
[]
[null,null,null,"ABLUFTSEITE Terzfrequenzband fm [Hz]"]
["Konstantenübergabe",null,null,100,125,160,200,250,315,400,500,630,800,1000,1250,1600,2000,2500,3150,4000,5000,6300,8000,10000]
[{"$f":"CONCATENATE(\"MPC-Q\",Lw!$B$505,Auslegung!$D$25)","v":"MPC-Q600250"},"k1",{"$f":"CONCATENATE(A527,B527)","v":"MPC-Q600250k1"},{"$f":"VLOOKUP($C527,$C$4:$X$503,D$504,FALSE)","v":-7.1722478491170456},{"$f":"VLOOKUP($C527,$C$4:$X$503,E$504,FALSE)","v":-14.194489176053938},{"$f":"VLOOKUP($C527,$C$4:$X$503,F$504,FALSE)","v":-16.606453867087122},-15.132917086648124,-19.880002368751345,-18.159265702324539,-21.788568900476761,-24.802141594675014,-28.078298410135545,-29.050840581782193,-30.698463791957277,-34.658509114896361,-36.74771373734081,-34.674788986814612,-32.332867687233332,-31.179634829578561,-23.824172862276285,-14.905313392503261,-6.235636359459833,0.50343833746053479,4.1279950524437208]
[{"$f":"CONCATENATE(\"MPC-Q\",Lw!$B$505,Auslegung!$D$25)","v":"MPC-Q600250"},"k2",{"$f":"CONCATENATE(A528,B528)","v":"MPC-Q600250k2"},{"$f":"VLOOKUP($C528,$C$4:$X$503,D$504,FALSE)","v":3.6423396187571222},{"$f":"VLOOKUP($C528,$C$4:$X$503,E$504,FALSE)","v":3.53071898823932},3.9550877965474092,4.688982667018986,3.9604111953706265,4.3766327244312526,5.0169065500473407,4.5357623395161797,4.3743699838642751,4.7177306554409641,4.7233395035530643,4.3027382332579656,4.2003245405703726,4.2176319578187123,4.2329631408313801,3.8319073091020912,3.895237101775157,3.9307571383702888,4.3265119088692554,4.6869207906765453,5.0199421336748955]
[{"$f":"CONCATENATE(\"MPC-Q\",Lw!$B$505,Auslegung!$D$25)","v":"MPC-Q600250"},"k3",{"$f":"CONCATENATE(A529,B529)","v":"MPC-Q600250k3"},{"$f":"VLOOKUP($C529,$C$4:$X$503,D$504,FALSE)","v":22.009477441345897},37.678797442394412,43.523762858758175,40.946561614223562,50.885708320402024,47.435137757878749,56.23182395410759,62.522825559329917,69.723851652823683,72.252959696789574,75.961260147860315,84.439851193635903,89.032467055394349,84.391303361923804,79.143653969544161,76.150755996445781,59.68421028640072,39.676460780815141,20.589176892797141,5.8051632113415925,-2.0071656846963015]
[{"$f":"CONCATENATE(\"MPC-Q\",Lw!$B$505,Auslegung!$D$25)","v":"MPC-Q600250"},"k4",{"$f":"CONCATENATE(A530,B530)","v":"MPC-Q600250k4"},{"$f":"VLOOKUP($C530,$C$4:$X$503,D$504,FALSE)","v":-2.3667497807092959},-5.2597627524403476,-6.2534365667891709,-5.6463633073719812,-7.6020689803253765,-6.8931569072792787,-8.3883462905888013,-9.6298793994110294,-10.979589642030549,-11.380252677944759,-12.059037529410535,-13.690497595406567,-14.551209899280593,-13.697208578426793,-12.732386033101299,-12.257283376876085,-9.2269847483707466,-5.5526024759029537,-1.9808801858967893,0.79547060368297506,{"$f":"VLOOKUP($C530,$C$4:$X$503,X$504,FALSE)","v":2.2887245744029299}]
[]
["Schallleistungspegelberechnung",null,"ABLUFT"]
[{"$f":"A527","v":"MPC-Q600250"},null,null,{"$f":"IF((D$527+D$528*LOG(Auslegung!$D$32)+D$529*LOG(Grunddaten!$H$142)+D$530*LOG(Grunddaten!$F$142))<0,0,D$527+D$528*LOG(Auslegung!$D$32)+D$529*LOG(Grunddaten!$H$142)+D$530*LOG(Grunddaten!$F$142))","v":11.399824888863428},{"$f":"IF((E$527+E$528*LOG(Auslegung!$D$32)+E$529*LOG(Grunddaten!$H$142)+E$530*LOG(Grunddaten!$F$142))<0,0,E$527+E$528*LOG(Auslegung!$D$32)+E$529*LOG(Grunddaten!$H$142)+E$530*LOG(Grunddaten!$F$142))","v":9.8257513284859321},{"$f":"IF((F$527+F$528*LOG(Auslegung!$D$32)+F$529*LOG(Grunddaten!$H$142)+F$530*LOG(Grunddaten!$F$142))<0,0,F$527+F$528*LOG(Auslegung!$D$32)+F$529*LOG(Grunddaten!$H$142)+F$530*LOG(Grunddaten!$F$142))","v":10.734921711930516},{"$f":"IF((G$527+G$528*LOG(Auslegung!$D$32)+G$529*LOG(Grunddaten!$H$142)+G$530*LOG(Grunddaten!$F$142))<0,0,G$527+G$528*LOG(Auslegung!$D$32)+G$529*LOG(Grunddaten!$H$142)+G$530*LOG(Grunddaten!$F$142))","v":13.291378229877157},{"$f":"IF((H$527+H$528*LOG(Auslegung!$D$32)+H$529*LOG(Grunddaten!$H$142)+H$530*LOG(Grunddaten!$F$142))<0,0,H$527+H$528*LOG(Auslegung!$D$32)+H$529*LOG(Grunddaten!$H$142)+H$530*LOG(Grunddaten!$F$142))","v":10.180864477003183},{"$f":"IF((I$527+I$528*LOG(Auslegung!$D$32)+I$529*LOG(Grunddaten!$H$142)+I$530*LOG(Grunddaten!$F$142))<0,0,I$527+I$528*LOG(Auslegung!$D$32)+I$529*LOG(Grunddaten!$H$142)+I$530*LOG(Grunddaten!$F$142))","v":11.785036913694958},{"$f":"IF((J$527+J$528*LOG(Auslegung!$D$32)+J$529*LOG(Grunddaten!$H$142)+J$530*LOG(Grunddaten!$F$142))<0,0,J$527+J$528*LOG(Auslegung!$D$32)+J$529*LOG(Grunddaten!$H$142)+J$530*LOG(Grunddaten!$F$142))","v":13.158468225011287},{"$f":"IF((K$527+K$528*LOG(Auslegung!$D$32)+K$529*LOG(Grunddaten!$H$142)+K$530*LOG(Grunddaten!$F$142))<0,0,K$527+K$528*LOG(Auslegung!$D$32)+K$529*LOG(Grunddaten!$H$142)+K$530*LOG(Grunddaten!$F$142))","v":11.125469928186476},{"$f":"IF((L$527+L$528*LOG(Auslegung!$D$32)+L$529*LOG(Grunddaten!$H$142)+L$530*LOG(Grunddaten!$F$142))<0,0,L$527+L$528*LOG(Auslegung!$D$32)+L$529*LOG(Grunddaten!$H$142)+L$530*LOG(Grunddaten!$F$142))","v":10.048587267361786},{"$f":"IF((M$527+M$528*LOG(Auslegung!$D$32)+M$529*LOG(Grunddaten!$H$142)+M$530*LOG(Grunddaten!$F$142))<0,0,M$527+M$528*LOG(Auslegung!$D$32)+M$529*LOG(Grunddaten!$H$142)+M$530*LOG(Grunddaten!$F$142))","v":10.954889279158605},{"$f":"IF((N$527+N$528*LOG(Auslegung!$D$32)+N$529*LOG(Grunddaten!$H$142)+N$530*LOG(Grunddaten!$F$142))<0,0,N$527+N$528*LOG(Auslegung!$D$32)+N$529*LOG(Grunddaten!$H$142)+N$530*LOG(Grunddaten!$F$142))","v":10.685203212033194},{"$f":"IF((O$527+O$528*LOG(Auslegung!$D$32)+O$529*LOG(Grunddaten!$H$142)+O$530*LOG(Grunddaten!$F$142))<0,0,O$527+O$528*LOG(Auslegung!$D$32)+O$529*LOG(Grunddaten!$H$142)+O$530*LOG(Grunddaten!$F$142))","v":8.676897691555137},{"$f":"IF((P$527+P$528*LOG(Auslegung!$D$32)+P$529*LOG(Grunddaten!$H$142)+P$530*LOG(Grunddaten!$F$142))<0,0,P$527+P$528*LOG(Auslegung!$D$32)+P$529*LOG(Grunddaten!$H$142)+P$530*LOG(Grunddaten!$F$142))","v":7.9917621450458096},{"$f":"IF((Q$527+Q$528*LOG(Auslegung!$D$32)+Q$529*LOG(Grunddaten!$H$142)+Q$530*LOG(Grunddaten!$F$142))<0,0,Q$527+Q$528*LOG(Auslegung!$D$32)+Q$529*LOG(Grunddaten!$H$142)+Q$530*LOG(Grunddaten!$F$142))","v":8.407397475387496},{"$f":"IF((R$527+R$528*LOG(Auslegung!$D$32)+R$529*LOG(Grunddaten!$H$142)+R$530*LOG(Grunddaten!$F$142))<0,0,R$527+R$528*LOG(Auslegung!$D$32)+R$529*LOG(Grunddaten!$H$142)+R$530*LOG(Grunddaten!$F$142))","v":8.8637421569877386},{"$f":"IF((S$527+S$528*LOG(Auslegung!$D$32)+S$529*LOG(Grunddaten!$H$142)+S$530*LOG(Grunddaten!$F$142))<0,0,S$527+S$528*LOG(Auslegung!$D$32)+S$529*LOG(Grunddaten!$H$142)+S$530*LOG(Grunddaten!$F$142))","v":7.8081636363987181},{"$f":"IF((T$527+T$528*LOG(Auslegung!$D$32)+T$529*LOG(Grunddaten!$H$142)+T$530*LOG(Grunddaten!$F$142))<0,0,T$527+T$528*LOG(Auslegung!$D$32)+T$529*LOG(Grunddaten!$H$142)+T$530*LOG(Grunddaten!$F$142))","v":9.2889948261085262},{"$f":"IF((U$527+U$528*LOG(Auslegung!$D$32)+U$529*LOG(Grunddaten!$H$142)+U$530*LOG(Grunddaten!$F$142))<0,0,U$527+U$528*LOG(Auslegung!$D$32)+U$529*LOG(Grunddaten!$H$142)+U$530*LOG(Grunddaten!$F$142))","v":10.955276438826662},{"$f":"IF((V$527+V$528*LOG(Auslegung!$D$32)+V$529*LOG(Grunddaten!$H$142)+V$530*LOG(Grunddaten!$F$142))<0,0,V$527+V$528*LOG(Auslegung!$D$32)+V$529*LOG(Grunddaten!$H$142)+V$530*LOG(Grunddaten!$F$142))","v":13.706879834445017},{"$f":"IF((W$527+W$528*LOG(Auslegung!$D$32)+W$529*LOG(Grunddaten!$H$142)+W$530*LOG(Grunddaten!$F$142))<0,0,W$527+W$528*LOG(Auslegung!$D$32)+W$529*LOG(Grunddaten!$H$142)+W$530*LOG(Grunddaten!$F$142))","v":16.011136580655229},{"$f":"IF((X$527+X$528*LOG(Auslegung!$D$32)+X$529*LOG(Grunddaten!$H$142)+X$530*LOG(Grunddaten!$F$142))<0,0,X$527+X$528*LOG(Auslegung!$D$32)+X$529*LOG(Grunddaten!$H$142)+X$530*LOG(Grunddaten!$F$142))","v":17.686511440416833},{"$f":"10*LOG(10^(0.1*D533)+10^(0.1*E533)+10^(0.1*F533)+10^(0.1*G533)+10^(0.1*H533)+10^(0.1*I533)+10^(0.1*J533)+10^(0.1*K533)+10^(0.1*L533)+10^(0.1*M533)+10^(0.1*N533)+10^(0.1*O533)+10^(0.1*P533)+10^(0.1*Q533)+10^(0.1*R533)+10^(0.1*S533)+10^(0.1*T533)+10^(0.1*U533)+10^(0.1*V533)+10^(0.1*W533)+10^(0.1*X533))","v":25.150966509687301}]
[]
[{"$f":"A509","v":"MPC-R-M600250"},null,null,{"$f":"10*LOG(10^(0.1*D509)+10^(0.1*E509)+10^(0.1*F509))","v":13.890735741498261},{"$f":"10*LOG(10^(0.1*G509)+10^(0.1*H509)+10^(0.1*I509))","v":15.468687601792242},{"$f":"10*LOG(10^(0.1*J509)+10^(0.1*K509)+10^(0.1*L509))","v":18.615036988696769},{"$f":"10*LOG(10^(0.1*M509)+10^(0.1*N509)+10^(0.1*O509))","v":21.222763041648591},{"$f":"10*LOG(10^(0.1*P509)+10^(0.1*Q509)+10^(0.1*R509))","v":19.225999127851075},{"$f":"10*LOG(10^(0.1*S509)+10^(0.1*T509)+10^(0.1*U509))","v":14.026144465577646},{"$f":"10*LOG(10^(0.1*V509)+10^(0.1*W509)+10^(0.1*X509))","v":9.395696340325534},{"$f":"10*LOG(10^(0.1*D535)+10^(0.1*E535)+10^(0.1*F535)+10^(0.1*G535)+10^(0.1*H535)+10^(0.1*I535)+10^(0.1*J535))","v":25.827243861609613}]
[{"$f":"A510","v":"MPC-R-M600250"},null,null,{"$f":"10*LOG(10^(0.1*D510)+10^(0.1*E510)+10^(0.1*F510))","v":39.752983954174852},{"$f":"10*LOG(10^(0.1*G510)+10^(0.1*H510)+10^(0.1*I510))","v":42.151286383430715},{"$f":"10*LOG(10^(0.1*J510)+10^(0.1*K510)+10^(0.1*L510))","v":59.041341305343941},{"$f":"10*LOG(10^(0.1*M510)+10^(0.1*N510)+10^(0.1*O510))","v":78.888553320000042},{"$f":"10*LOG(10^(0.1*P510)+10^(0.1*Q510)+10^(0.1*R510))","v":79.461657876443837},{"$f":"10*LOG(10^(0.1*S510)+10^(0.1*T510)+10^(0.1*U510))","v":50.746415493453569},{"$f":"10*LOG(10^(0.1*V510)+10^(0.1*W510)+10^(0.1*X510))","v":7.8067409048322824},82.219580952559909]
[{"$f":"A511","v":"MPC-R-M600250"},null,null,{"$f":"10*LOG(10^(0.1*D511)+10^(0.1*E511)+10^(0.1*F511))","v":-1.8626116798581618},{"$f":"10*LOG(10^(0.1*G511)+10^(0.1*H511)+10^(0.1*I511))","v":-4.5610213724625712},{"$f":"10*LOG(10^(0.1*J511)+10^(0.1*K511)+10^(0.1*L511))","v":-9.7293045903093986},{"$f":"10*LOG(10^(0.1*M511)+10^(0.1*N511)+10^(0.1*O511))","v":-15.950037104709939},{"$f":"10*LOG(10^(0.1*P511)+10^(0.1*Q511)+10^(0.1*R511))","v":-14.330453010387229},{"$f":"10*LOG(10^(0.1*S511)+10^(0.1*T511)+10^(0.1*U511))","v":-2.9209230349547806},{"$f":"10*LOG(10^(0.1*V511)+10^(0.1*W511)+10^(0.1*X511))","v":7.5194903452518558},8.6504102516511754]
[{"$f":"A514","v":"MPC-R-M600250"},null,null,{"$f":"10*LOG(10^(0.1*D514)+10^(0.1*E514)+10^(0.1*F514))","v":27.20615244439831},{"$f":"10*LOG(10^(0.1*G514)+10^(0.1*H514)+10^(0.1*I514))","v":30.905519542826937},{"$f":"10*LOG(10^(0.1*J514)+10^(0.1*K514)+10^(0.1*L514))","v":35.897211623437734},{"$f":"10*LOG(10^(0.1*M514)+10^(0.1*N514)+10^(0.1*O514))","v":38.130825576990105},{"$f":"10*LOG(10^(0.1*P514)+10^(0.1*Q514)+10^(0.1*R514))","v":32.387593454255935},{"$f":"10*LOG(10^(0.1*S514)+10^(0.1*T514)+10^(0.1*U514))","v":25.25700115341154},{"$f":"10*LOG(10^(0.1*V514)+10^(0.1*W514)+10^(0.1*X514))","v":22.455303026490384},41.581280489233833]
[{"$f":"A515","v":0},null,null,{"$f":"10*LOG(10^(0.1*D515)+10^(0.1*E515)+10^(0.1*F515))","v":{"$error":"#REF!"}},{"$f":"10*LOG(10^(0.1*G515)+10^(0.1*H515)+10^(0.1*I515))","v":{"$error":"#REF!"}},{"$f":"10*LOG(10^(0.1*J515)+10^(0.1*K515)+10^(0.1*L515))","v":{"$error":"#REF!"}},{"$f":"10*LOG(10^(0.1*M515)+10^(0.1*N515)+10^(0.1*O515))","v":{"$error":"#REF!"}},{"$f":"10*LOG(10^(0.1*P515)+10^(0.1*Q515)+10^(0.1*R515))","v":{"$error":"#REF!"}},{"$f":"10*LOG(10^(0.1*S515)+10^(0.1*T515)+10^(0.1*U515))","v":{"$error":"#REF!"}},{"$f":"10*LOG(10^(0.1*V515)+10^(0.1*W515)+10^(0.1*X515))","v":{"$error":"#REF!"}},{"$error":"#REF!"}]
[{"$f":"A516","v":0},null,null,{"$f":"10*LOG(10^(0.1*D516)+10^(0.1*E516)+10^(0.1*F516))","v":{"$error":"#REF!"}},{"$f":"10*LOG(10^(0.1*G516)+10^(0.1*H516)+10^(0.1*I516))","v":{"$error":"#REF!"}},{"$f":"10*LOG(10^(0.1*J516)+10^(0.1*K516)+10^(0.1*L516))","v":{"$error":"#REF!"}},{"$f":"10*LOG(10^(0.1*M516)+10^(0.1*N516)+10^(0.1*O516))","v":{"$error":"#REF!"}},{"$f":"10*LOG(10^(0.1*P516)+10^(0.1*Q516)+10^(0.1*R516))","v":{"$error":"#REF!"}},{"$f":"10*LOG(10^(0.1*S516)+10^(0.1*T516)+10^(0.1*U516))","v":{"$error":"#REF!"}},{"$f":"10*LOG(10^(0.1*V516)+10^(0.1*W516)+10^(0.1*X516))","v":{"$error":"#REF!"}},{"$error":"#REF!"}]
[{"$f":"A517","v":0},null,null,{"$f":"10*LOG(10^(0.1*D517)+10^(0.1*E517)+10^(0.1*F517))","v":{"$error":"#REF!"}},{"$f":"10*LOG(10^(0.1*G517)+10^(0.1*H517)+10^(0.1*I517))","v":{"$error":"#REF!"}},{"$f":"10*LOG(10^(0.1*J517)+10^(0.1*K517)+10^(0.1*L517))","v":{"$error":"#REF!"}},{"$f":"10*LOG(10^(0.1*M517)+10^(0.1*N517)+10^(0.1*O517))","v":{"$error":"#REF!"}},{"$f":"10*LOG(10^(0.1*P517)+10^(0.1*Q517)+10^(0.1*R517))","v":{"$error":"#REF!"}},{"$f":"10*LOG(10^(0.1*S517)+10^(0.1*T517)+10^(0.1*U517))","v":{"$error":"#REF!"}},{"$f":"10*LOG(10^(0.1*V517)+10^(0.1*W517)+10^(0.1*X517))","v":{"$error":"#REF!"}},{"$error":"#REF!"}]
[{"$f":"#REF!","v":{"$error":"#REF!"}},null,null,{"$f":"10*LOG(10^(0.1*#REF!)+10^(0.1*#REF!)+10^(0.1*#REF!))","v":{"$error":"#REF!"}},{"$f":"10*LOG(10^(0.1*#REF!)+10^(0.1*#REF!)+10^(0.1*#REF!))","v":{"$error":"#REF!"}},{"$f":"10*LOG(10^(0.1*#REF!)+10^(0.1*#REF!)+10^(0.1*#REF!))","v":{"$error":"#REF!"}},{"$f":"10*LOG(10^(0.1*#REF!)+10^(0.1*#REF!)+10^(0.1*#REF!))","v":{"$error":"#REF!"}},{"$f":"10*LOG(10^(0.1*#REF!)+10^(0.1*#REF!)+10^(0.1*#REF!))","v":{"$error":"#REF!"}},{"$f":"10*LOG(10^(0.1*#REF!)+10^(0.1*#REF!)+10^(0.1*#REF!))","v":{"$error":"#REF!"}},{"$f":"10*LOG(10^(0.1*#REF!)+10^(0.1*#REF!)+10^(0.1*#REF!))","v":{"$error":"#REF!"}},{"$error":"#REF!"}]
[{"$f":"#REF!","v":{"$error":"#REF!"}},null,null,{"$f":"10*LOG(10^(0.1*#REF!)+10^(0.1*#REF!)+10^(0.1*#REF!))","v":{"$error":"#REF!"}},{"$f":"10*LOG(10^(0.1*#REF!)+10^(0.1*#REF!)+10^(0.1*#REF!))","v":{"$error":"#REF!"}},{"$f":"10*LOG(10^(0.1*#REF!)+10^(0.1*#REF!)+10^(0.1*#REF!))","v":{"$error":"#REF!"}},{"$f":"10*LOG(10^(0.1*#REF!)+10^(0.1*#REF!)+10^(0.1*#REF!))","v":{"$error":"#REF!"}},{"$f":"10*LOG(10^(0.1*#REF!)+10^(0.1*#REF!)+10^(0.1*#REF!))","v":{"$error":"#REF!"}},{"$f":"10*LOG(10^(0.1*#REF!)+10^(0.1*#REF!)+10^(0.1*#REF!))","v":{"$error":"#REF!"}},{"$f":"10*LOG(10^(0.1*#REF!)+10^(0.1*#REF!)+10^(0.1*#REF!))","v":{"$error":"#REF!"}},{"$error":"#REF!"}]
[{"$f":"#REF!","v":{"$error":"#REF!"}},null,null,{"$f":"10*LOG(10^(0.1*#REF!)+10^(0.1*#REF!)+10^(0.1*#REF!))","v":{"$error":"#REF!"}},{"$f":"10*LOG(10^(0.1*#REF!)+10^(0.1*#REF!)+10^(0.1*#REF!))","v":{"$error":"#REF!"}},{"$f":"10*LOG(10^(0.1*#REF!)+10^(0.1*#REF!)+10^(0.1*#REF!))","v":{"$error":"#REF!"}},{"$f":"10*LOG(10^(0.1*#REF!)+10^(0.1*#REF!)+10^(0.1*#REF!))","v":{"$error":"#REF!"}},{"$f":"10*LOG(10^(0.1*#REF!)+10^(0.1*#REF!)+10^(0.1*#REF!))","v":{"$error":"#REF!"}},{"$f":"10*LOG(10^(0.1*#REF!)+10^(0.1*#REF!)+10^(0.1*#REF!))","v":{"$error":"#REF!"}},{"$f":"10*LOG(10^(0.1*#REF!)+10^(0.1*#REF!)+10^(0.1*#REF!))","v":{"$error":"#REF!"}},{"$error":"#REF!"}]
[{"$f":"#REF!","v":{"$error":"#REF!"}},null,null,{"$f":"10*LOG(10^(0.1*#REF!)+10^(0.1*#REF!)+10^(0.1*#REF!))","v":{"$error":"#REF!"}},{"$f":"10*LOG(10^(0.1*#REF!)+10^(0.1*#REF!)+10^(0.1*#REF!))","v":{"$error":"#REF!"}},{"$f":"10*LOG(10^(0.1*#REF!)+10^(0.1*#REF!)+10^(0.1*#REF!))","v":{"$error":"#REF!"}},{"$f":"10*LOG(10^(0.1*#REF!)+10^(0.1*#REF!)+10^(0.1*#REF!))","v":{"$error":"#REF!"}},{"$f":"10*LOG(10^(0.1*#REF!)+10^(0.1*#REF!)+10^(0.1*#REF!))","v":{"$error":"#REF!"}},{"$f":"10*LOG(10^(0.1*#REF!)+10^(0.1*#REF!)+10^(0.1*#REF!))","v":{"$error":"#REF!"}},{"$f":"10*LOG(10^(0.1*#REF!)+10^(0.1*#REF!)+10^(0.1*#REF!))","v":{"$error":"#REF!"}},{"$error":"#REF!"}]
[{"$f":"#REF!","v":{"$error":"#REF!"}},null,null,{"$f":"10*LOG(10^(0.1*#REF!)+10^(0.1*#REF!)+10^(0.1*#REF!))","v":{"$error":"#REF!"}},{"$f":"10*LOG(10^(0.1*#REF!)+10^(0.1*#REF!)+10^(0.1*#REF!))","v":{"$error":"#REF!"}},{"$f":"10*LOG(10^(0.1*#REF!)+10^(0.1*#REF!)+10^(0.1*#REF!))","v":{"$error":"#REF!"}},{"$f":"10*LOG(10^(0.1*#REF!)+10^(0.1*#REF!)+10^(0.1*#REF!))","v":{"$error":"#REF!"}},{"$f":"10*LOG(10^(0.1*#REF!)+10^(0.1*#REF!)+10^(0.1*#REF!))","v":{"$error":"#REF!"}},{"$f":"10*LOG(10^(0.1*#REF!)+10^(0.1*#REF!)+10^(0.1*#REF!))","v":{"$error":"#REF!"}},{"$f":"10*LOG(10^(0.1*#REF!)+10^(0.1*#REF!)+10^(0.1*#REF!))","v":{"$error":"#REF!"}},{"$error":"#REF!"}]
[{"$f":"#REF!","v":{"$error":"#REF!"}},null,null,{"$f":"10*LOG(10^(0.1*#REF!)+10^(0.1*#REF!)+10^(0.1*#REF!))","v":{"$error":"#REF!"}},{"$f":"10*LOG(10^(0.1*#REF!)+10^(0.1*#REF!)+10^(0.1*#REF!))","v":{"$error":"#REF!"}},{"$f":"10*LOG(10^(0.1*#REF!)+10^(0.1*#REF!)+10^(0.1*#REF!))","v":{"$error":"#REF!"}},{"$f":"10*LOG(10^(0.1*#REF!)+10^(0.1*#REF!)+10^(0.1*#REF!))","v":{"$error":"#REF!"}},{"$f":"10*LOG(10^(0.1*#REF!)+10^(0.1*#REF!)+10^(0.1*#REF!))","v":{"$error":"#REF!"}},{"$f":"10*LOG(10^(0.1*#REF!)+10^(0.1*#REF!)+10^(0.1*#REF!))","v":{"$error":"#REF!"}},{"$f":"10*LOG(10^(0.1*#REF!)+10^(0.1*#REF!)+10^(0.1*#REF!))","v":{"$error":"#REF!"}},{"$error":"#REF!"}]
[{"$f":"#REF!","v":{"$error":"#REF!"}},null,null,{"$f":"10*LOG(10^(0.1*#REF!)+10^(0.1*#REF!)+10^(0.1*#REF!))","v":{"$error":"#REF!"}},{"$f":"10*LOG(10^(0.1*#REF!)+10^(0.1*#REF!)+10^(0.1*#REF!))","v":{"$error":"#REF!"}},{"$f":"10*LOG(10^(0.1*#REF!)+10^(0.1*#REF!)+10^(0.1*#REF!))","v":{"$error":"#REF!"}},{"$f":"10*LOG(10^(0.1*#REF!)+10^(0.1*#REF!)+10^(0.1*#REF!))","v":{"$error":"#REF!"}},{"$f":"10*LOG(10^(0.1*#REF!)+10^(0.1*#REF!)+10^(0.1*#REF!))","v":{"$error":"#REF!"}},{"$f":"10*LOG(10^(0.1*#REF!)+10^(0.1*#REF!)+10^(0.1*#REF!))","v":{"$error":"#REF!"}},{"$f":"10*LOG(10^(0.1*#REF!)+10^(0.1*#REF!)+10^(0.1*#REF!))","v":{"$error":"#REF!"}},{"$error":"#REF!"}]
[{"$f":"#REF!","v":{"$error":"#REF!"}},null,null,{"$f":"10*LOG(10^(0.1*#REF!)+10^(0.1*#REF!)+10^(0.1*#REF!))","v":{"$error":"#REF!"}},{"$f":"10*LOG(10^(0.1*#REF!)+10^(0.1*#REF!)+10^(0.1*#REF!))","v":{"$error":"#REF!"}},{"$f":"10*LOG(10^(0.1*#REF!)+10^(0.1*#REF!)+10^(0.1*#REF!))","v":{"$error":"#REF!"}},{"$f":"10*LOG(10^(0.1*#REF!)+10^(0.1*#REF!)+10^(0.1*#REF!))","v":{"$error":"#REF!"}},{"$f":"10*LOG(10^(0.1*#REF!)+10^(0.1*#REF!)+10^(0.1*#REF!))","v":{"$error":"#REF!"}},{"$f":"10*LOG(10^(0.1*#REF!)+10^(0.1*#REF!)+10^(0.1*#REF!))","v":{"$error":"#REF!"}},{"$f":"10*LOG(10^(0.1*#REF!)+10^(0.1*#REF!)+10^(0.1*#REF!))","v":{"$error":"#REF!"}},{"$error":"#REF!"}]
[null,null,null,2,3,4,5,6,7,8,9]
[]
["A2",null,null,25.195,16.544,7.89,2.052,-0.622,-3.2959999999999998,-4.2960000000000003]
["B2",null,null,0.77,0.84399999999999997,0.91800000000000004,0.98099999999999998,1.004,1.0269999999999999,1.0269999999999999]
["LWNC","ZUL","NC-Bewertungskurven",{"$f":"D521/D553-D552","v":10.137665512205594},{"$f":"E521/E553-E552","v":20.07391415026888},31.213716365400579,36.817343095810507,32.880559217386391,27.888990412279981,26.160949392882557,{"$f":"IF(MAX(D554:J554)<15,\"<15\",MAX(D554:J554))","v":36.817343095810507}]
[null,"ABL",null,{"$f":"D522/D553-D552","v":-5.1014106127610148},{"$f":"E522/E553-E552","v":3.2507005584611726},9.9871874693991884,13.227190239711542,13.776173925994224,17.231300716901561,24.61435305157611,{"$f":"IF(MAX(D555:J555)<15,\"<15\",MAX(D555:J555))","v":24.61435305157611}]
[null,null,15,{"$f":"D$552+D$553*$C556","v":36.745000000000005},{"$f":"E$552+E$553*$C556","v":29.204000000000001},21.66,16.766999999999999,14.438000000000001,12.109,11.108999999999998]
[null,null,20,{"$f":"D$552+D$553*$C557","v":40.594999999999999},33.423999999999999,26.25,21.672000000000001,19.457999999999998,17.244,16.244]
[null,null,25,{"$f":"D$552+D$553*$C558","v":44.445},37.643999999999998,30.84,26.576999999999998,24.478000000000002,22.378999999999998,21.378999999999998]
[null,null,30,48.295000000000002,41.864000000000004,35.43,31.481999999999999,29.498000000000001,27.513999999999999,26.513999999999999]
[null,null,35,52.144999999999996,46.084000000000003,40.020000000000003,36.387,34.518000000000001,32.649000000000001,31.649000000000001]
[null,null,40,55.995000000000005,50.304000000000002,44.61,41.292000000000002,39.537999999999997,37.783999999999999,36.783999999999999]
[null,null,45,59.844999999999999,54.524000000000001,49.2,46.196999999999996,44.558,42.918999999999997,41.918999999999997]
[null,null,50,63.695,58.744,53.79,51.101999999999997,49.578000000000003,48.053999999999995,47.053999999999995]
[null,null,55,67.545000000000002,62.963999999999999,58.38,56.006999999999998,54.597999999999999,53.188999999999993,52.188999999999993]
[null,null,60,71.39500000000001,67.183999999999997,62.970000000000006,60.911999999999999,59.618000000000002,58.323999999999998,57.323999999999998]
[null,"NC-Kurve Zuluft",null,{"$f":"D$552+D$553*$K$554","v":53.54435418377409},{"$f":"E$552+E$553*$K$554","v":47.617837572864069},41.688320961954048,38.169813576990109,36.342612468193749,34.51541135939739,33.51541135939739]
[null,"NC-Kurve Abluft",null,{"$f":"D$552+D$553*$K$555","v":44.14805184971361},{"$f":"E$552+E$553*$K$555","v":37.318513975530237},30.485976101346871,26.198680343596163,24.090810463782415,21.982940583968663,20.982940583968663]
[null,"Grenzkurve",null,{"$f":"IF(AND($D$567>$D$566,$E$567>$E$566,$F$567>$F$566,$G$567>$G$566,$H$567>$H$566,$I$567>$I$566,$J$567>$J$566),D567,D566)","v":53.54435418377409},{"$f":"IF(AND($D$567>$D$566,$E$567>$E$566,$F$567>$F$566,$G$567>$G$566,$H$567>$H$566,$I$567>$I$566,$J$567>$J$566),E567,E566)","v":47.617837572864069},41.688320961954048,38.169813576990109,36.342612468193749,34.51541135939739,33.51541135939739,{"$f":"MAX(K554:K555)","v":36.817343095810507}]
[]
[]
[]
["T[s] nach VDI 2081",null,null,null,null,null,"Nachhallzeit","Richtungsfaktor","Raumvolumen","äqu. Absorptionsfläche"]
["Raumart",null,null,null,"s",null,"t","Q","V","A"]
["Einzelbüro",null,null,null,0.5,null,"s",null,"m³","m²Sabine"]
["Großraumbüro",null,null,null,0.5,"Einzelbüro",0.5,4,74.819999999999993,{"$f":"0.163*I575/G575","v":24.39132}]
["Werkstätten",null,null,null,1.5]
["Ruheraum, Pausenraum",null,null,null,1]
["Untersuchungsraum Krankenhaus",null,null,null,2]
["Rundfunk-, Fernsehstudio",null,null,null,0.5]
["Chemielabor",null,null,null,2]
["Wasch- und WC-Raum, Umkleide",null,null,null,2]
["Schwimmbad",null,null,null,2]
["EDV-Raum",null,null,null,1.5]
["Konzertsaal",null,null,null,1.5]
["Lesesaal",null,null,null,1]
["Museum",null,null,null,1.5]
["Küche",null,null,null,1.5]
["Theater, Kino",null,null,null,1]
["Klassen- Seminarraum",null,null,null,1]
["Gaststätte",null,null,null,1]
["kein Typ",null,null,null,"x"]
["Konferenzraum",null,null,null,1]
["Hotelzimmer",null,null,null,0.5]
["Hörsaal",null,null,null,1]
["Bettenzimmer Krankenhaus",null,null,null,1]
["Verkaufsraum",null,null,null,1]
["Sporthalle",null,null,null,2]

{"sheet":"DR","index":6,"n_rows":32,"n_cols":4,"rows_kept":32,"cut":false,"hidden":true,"merged":[[0,0,0,10]]}
["Berechnung des Zugluftrisikos"]
["Achtung: Automatisierte Konstantenauswahl aus den \"-CAP\" Arbeitsblättern"]
["Annahme:","Turbulenzgrad =",{"$f":"IF(Auslegung!D12=\"MPC-Q\",20,40)","v":40},"%"]
[]
["Konstanten Temperaturverhältnis",null,"K051",{"$f":"SUM('RS-CAP'!$C$51,'RM-CAP'!$C$51,'RL-CAP'!$C$51,'V-CAP'!$C$51,'Q-CAP'!$C$51)","v":0.31}]
[null,null,"K052",{"$f":"SUM('RS-CAP'!$C$52,'RM-CAP'!$C$52,'RL-CAP'!$C$52,'V-CAP'!$C$52,'Q-CAP'!$C$52)","v":1}]
["Temperaturen","Zuluft",{"$f":"Auslegung!$D$34","v":18}]
[null,"Raum",{"$f":"Auslegung!$D$35","v":26}]
[]
["1. Zugluftrisiko im Fußbodenbereich"]
[null,"Lauflänge",{"$f":"xkr._vx!$L$24","v":9.5}]
[null,"Luftgeschwindigkeit, errechnet",{"$f":"xkr._vx!$N$24","v":3.9307787182419951E-2}]
[null,"Luftgeschwindigkeit, gesetzt",{"$f":"IF(C12<0.05,0.05,C12)","v":0.05}]
[null,"lok. Temperaturdifferenz",{"$f":"($C$8-$C$7)*$D$5*(1/C11)^$D$6","v":0.26105263157894737}]
[null,"Absolute Temperatur",{"$f":"C8-C14","v":25.738947368421051}]
[null,"Zugluftrisiko",{"$f":"IF((34-C15)*((C13-0.05)^0.62)*(0.37*C13*$C$3+3.14)>100,100,IF((34-C15)*((C13-0.05)^0.62)*(0.37*C13*$C$3+3.14)<0,0,(34-C15)*((C13-0.05)^0.62)*(0.37*C13*$C$3+3.14)))","v":0}]
[]
["2. Zugluftrisiko nach Stoßpunkt"]
[null,"Lauflänge",{"$f":"IF(Auslegung!$D$12=\"MPC-Q\",xkr._vx!$L$31,xkr._vx!$L$26)","v":2.2000000000000002}]
[null,"Luftgeschwindigkeit, errechnet",{"$f":"IF(Auslegung!$D$12=\"MPC-Q\",xkr._vx!$N$31,xkr._vx!$N$26)","v":0.10289682405460553}]
[null,"Luftgeschwindigkeit, gesetzt",{"$f":"IF(C20<0.05,0.05,C20)","v":0.10289682405460553}]
[null,"lok. Temperaturdifferenz",{"$f":"($C$8-$C$7)*$D$5*(1/C19)^$D$6","v":1.1272727272727272}]
[null,"Absolute Temperatur",{"$f":"C8-C22","v":24.872727272727271}]
[null,"Zugluftrisiko",{"$f":"IF((34-C23)*((C21-0.05)^0.62)*(0.37*C21*$C$3+3.14)>100,100,IF((34-C23)*((C21-0.05)^0.62)*(0.37*C21*$C$3+3.14)<0,0,(34-C23)*((C21-0.05)^0.62)*(0.37*C21*$C$3+3.14)))","v":6.8789311830925861}]
[]
["3. Zugluftrisiko nach Ablösen an X_kritisch"]
[null,"Lauflänge",{"$f":"xkr._vx!$L$28","v":3.5924536257468658}]
[null,"Luftgeschwindigkeit, errechnet",{"$f":"xkr._vx!N28","v":9.7725371276885145E-2}]
[null,"Luftgeschwindigkeit, gesetzt",{"$f":"IF(C28<0.05,0.05,C28)","v":9.7725371276885145E-2}]
[null,"lok. Temperaturdifferenz",{"$f":"($C$8-$C$7)*$D$5*(1/C27)^$D$6","v":0.69033598157705156}]
[null,"Absolute Temperatur",{"$f":"C8-C30","v":25.30966401842295}]
[null,"Zugluftrisiko",{"$f":"IF((34-C31)*((C29-0.05)^0.62)*(0.37*C29*$C$3+3.14)>100,100,IF((34-C31)*((C29-0.05)^0.62)*(0.37*C29*$C$3+3.14)<0,0,(34-C31)*((C29-0.05)^0.62)*(0.37*C29*$C$3+3.14)))","v":6.0440349022645217}]

{"sheet":"xkr._vx","index":7,"n_rows":66,"n_cols":14,"rows_kept":66,"cut":false,"hidden":true,"merged":[]}
["Geschwindigkeit im Strahl und kritischer Strahlweg",null,null,null,null,null,"Annahme:","Winkel nach xkrit",45]
["Achtung: Automatisierte Konstantenauswahl aus den \"-CAP\" Arbeitsblättern"]
["Konstanten","K031",{"$f":"SUM('RS-CAP'!C44,'RM-CAP'!C44,'RL-CAP'!C44,'V-CAP'!C44,'Q-CAP'!C44)","v":6.6062351377575983E-4},null,"Konstanten:","K041",{"$f":"SUM('RS-CAP'!C48,'RM-CAP'!C48,'RL-CAP'!C48,'V-CAP'!C48,'Q-CAP'!C48)","v":6.6454867776380997E-5},null,"Konstanten","K071",{"$f":"SUM('RM-CAP'!C53,'Q-CAP'!C53)","v":0}]
[null,"K032",{"$f":"SUM('RS-CAP'!C45,'RM-CAP'!C45,'RL-CAP'!C45,'V-CAP'!C45,'Q-CAP'!C45)","v":1},null,null,"K042",{"$f":"SUM('RS-CAP'!C49,'RM-CAP'!C49,'RL-CAP'!C49,'V-CAP'!C49,'Q-CAP'!C49)","v":0.47201071612740536},null,null,"K072",{"$f":"SUM('RM-CAP'!C54,'Q-CAP'!C54)","v":0}]
[null,"K033",{"$f":"SUM('RS-CAP'!C46,'RM-CAP'!C46,'RL-CAP'!C46,'V-CAP'!C46,'Q-CAP'!C46)","v":0.93653411518802254},null,null,"K043",{"$f":"SUM('RS-CAP'!C50,'RM-CAP'!C50,'RL-CAP'!C50,'V-CAP'!C50,'Q-CAP'!C50)","v":1.8145300481212068},null,null,"K081",{"$f":"SUM('RM-CAP'!C55,'Q-CAP'!C55)","v":0}]
[null,"K034",{"$f":"SUM('RS-CAP'!C47,'RM-CAP'!C47,'RL-CAP'!C47,'V-CAP'!C47,'Q-CAP'!C47)","v":0},null,null,"Dt0",{"$f":"IF(Auslegung!$D$35-Auslegung!$D$34>0,Auslegung!$D$35-Auslegung!$D$34,ABS(Auslegung!$D$35-Auslegung!$D$34))","v":8},null,null,"K082",{"$f":"SUM('RM-CAP'!C56,'Q-CAP'!C56)","v":0}]
[null,null,null,null,null,null,null,null,null,"K083",{"$f":"SUM('RM-CAP'!C57,'Q-CAP'!C57)","v":0}]
[null,"Lauflänge","Geschwindigkeit im Strahl horizontal","Geschwindigkeit im Strahl vertikal",null,"kritischer Strahlweg Anzeige","kritischer Strahlweg","vertikaler Strahlweg",null,"Geschwindigkeit im Strahl an xKr"]
[null,"L","v0","v1",null,"xkr._Anzeige","xkr.","y",null,"v0"]
[null,"m","m/s","m/s",null,"m","m","m",null,"m/s"]
[null,0.5,{"$f":"$C$3*Auslegung!$D$32*(1/xkr._vx!B11)^xkr._vx!$C$5","v":0.6195480127335522},{"$f":"1/B11*$J$11","v":0.35571675947498355},null,{"$f":"IF($J$27<Auslegung!$D$39,$J$27,\">Raumlänge\")","v":1.895397350899152},{"$f":"IF(J27<Auslegung!D39,xkr._vx!J27,Auslegung!D39)","v":1.895397350899152},{"$f":"(Auslegung!$D$37-Auslegung!$D$38)/SIN(45/180*PI())","v":1.697056274847714},null,{"$f":"$C$3*Auslegung!$D$32*(1/xkr._vx!G11)^(xkr._vx!$C$5)","v":0.17785837973749177}]
[null,0.6,{"$f":"$C$3*Auslegung!$D$32*(1/xkr._vx!B12)^xkr._vx!$C$5","v":0.52229880244415539},{"$f":"1/B12*$J$11","v":0.29643063289581961}]
[null,0.7,{"$f":"$C$3*Auslegung!$D$32*(1/xkr._vx!B13)^xkr._vx!$C$5","v":0.45208602026730599},0.25408339962498827]
[null,0.8,{"$f":"$C$3*Auslegung!$D$32*(1/xkr._vx!B14)^xkr._vx!$C$5","v":0.39894189008947023},0.22232297467186471]
[null,0.9,{"$f":"$C$3*Auslegung!$D$32*(1/xkr._vx!B15)^xkr._vx!$C$5","v":0.3572757656266814},{"$f":"1/B15*$J$11","v":0.19762042193054644}]
[null,1,{"$f":"$C$3*Auslegung!$D$32*(1/xkr._vx!B16)^xkr._vx!$C$5","v":0.32370552175012229},0.17785837973749177]
[null,1.1000000000000001,{"$f":"$C$3*Auslegung!$D$32*(1/xkr._vx!B17)^xkr._vx!$C$5","v":0.29606321156474863},0.16168943612499251]
[null,1.2,{"$f":"$C$3*Auslegung!$D$32*(1/xkr._vx!B18)^xkr._vx!$C$5","v":0.27289411454760232},0.14821531644790981]
[null,1.3,{"$f":"$C$3*Auslegung!$D$32*(1/xkr._vx!B19)^xkr._vx!$C$5","v":0.25318517417386993},0.13681413825960903]
[null,1.4,{"$f":"$C$3*Auslegung!$D$32*(1/xkr._vx!B20)^xkr._vx!$C$5","v":0.2362088781802},{"$f":"1/B20*$J$11","v":0.12704169981249414}]
[null,1.5,{"$f":"$C$3*Auslegung!$D$32*(1/xkr._vx!B21)^xkr._vx!$C$5","v":0.22142907006420892},0.11857225315832784]
[null,1.6,{"$f":"$C$3*Auslegung!$D$32*(1/xkr._vx!B22)^xkr._vx!$C$5","v":0.20844178340530126},0.11116148733593235,null,null,null,null," 1/2 Durchlassabstand","hor. Lauflänge","ver. Lauflänge","ges. Lauflänge","Geschw. Endpunkt","Geschw. OK A-Ber."]
[null,1.7,{"$f":"$C$3*Auslegung!$D$32*(1/xkr._vx!B23)^xkr._vx!$C$5","v":0.19693677919042407},0.10462257631617164,"Betrachtung Strahlweg frei entlang der Decke bis Wandkante",null,null,null,null,{"$f":"Auslegung!$D$41","v":6},null,null,{"$f":"$C$3*Auslegung!$D$32*(1/xkr._vx!J23)^xkr._vx!$C$5","v":6.0448414587515278E-2}]
[null,1.8,{"$f":"$C$3*Auslegung!$D$32*(1/xkr._vx!B24)^xkr._vx!$C$5","v":0.18667179257113942},9.8810210965273218E-2,"Betrachtung Strahlweg von Wandkante bis Fußboden Aufenthaltsbereich",null,null,null,null,null,{"$f":"Auslegung!$D$37+0.5","v":3.5},{"$f":"K24+J23","v":9.5},null,{"$f":"$C$3*Auslegung!$D$32*(1/xkr._vx!L24)^xkr._vx!$C$5","v":3.9307787182419951E-2}]
[null,1.9,{"$f":"$C$3*Auslegung!$D$32*(1/xkr._vx!B25)^xkr._vx!$C$5","v":0.17745484064668191},9.3609673546048294E-2,"Betrachtung Strahlweg von Durchlassmitte bis Stoßpunkt",null,null,null,{"$f":"Auslegung!$D$42/2","v":1},null,null,null,{"$f":"$C$3*Auslegung!$D$32*(1/xkr._vx!I25)^xkr._vx!$C$5","v":0.32370552175012229}]
[null,2,{"$f":"$C$3*Auslegung!$D$32*(1/xkr._vx!B26)^xkr._vx!$C$5","v":0.16913179068913209},8.8929189868745886E-2,"Betrachtung Freistrahl ab Stoßpunkt bis Oberkante Aufenthaltsbereich",null,null,null,null,null,{"$f":"Auslegung!$D$37-Auslegung!$D$38","v":1.2},{"$f":"K26+I25","v":2.2000000000000002},null,{"$f":"$C$3*Auslegung!$D$32*(1/((xkr._vx!I25+xkr._vx!K26)+xkr._vx!$C$4*xkr._vx!K26))^xkr._vx!$C$5","v":0.10289682405460553}]
[null,2.1,{"$f":"$C$3*Auslegung!$D$32*(1/xkr._vx!B27)^xkr._vx!$C$5","v":0.16157744839683738},8.4694466541662738E-2,"Betrachtung Strahlweg bis xkritisch",null,null,null,null,{"$f":"$G$3*Auslegung!$D$32^$G$5*(1/xkr._vx!$G$6^(xkr._vx!$G$4))","v":1.895397350899152},null,null,{"$f":"$C$3*Auslegung!$D$32*(1/xkr._vx!J27)^xkr._vx!$C$5","v":0.17785837973749177}]
[null,2.2000000000000002,{"$f":"$C$3*Auslegung!$D$32*(1/xkr._vx!B28)^xkr._vx!$C$5","v":0.15468905460245638},8.0844718062496254E-2,"Betrachtung von xkritisch bis Oberkante Aufenthaltsbereich",null,null,null,null,null,{"$f":"(Auslegung!$D$37-Auslegung!$D$38)/SIN($I$1/180*PI())","v":1.697056274847714},{"$f":"J27+K28","v":3.5924536257468658},null,{"$f":"IFERROR($C$3*Auslegung!$D$32*(1/xkr._vx!L28)^xkr._vx!$C$5,\"\")","v":9.7725371276885145E-2}]
[null,2.2999999999999998,{"$f":"$C$3*Auslegung!$D$32*(1/xkr._vx!B29)^xkr._vx!$C$5","v":0.14838146300115798},7.7329730320648604E-2]
[null,2.4,{"$f":"$C$3*Auslegung!$D$32*(1/xkr._vx!B30)^xkr._vx!$C$5","v":0.14258351236155176},7.4107658223954903E-2,"Betrachtung MPC-Q: vertikaler isothermer Freistrahl",null,null,"Durchlassfläche:",{"$f":"((Auslegung!D18-60)/1000)^2","v":0.29160000000000003}]
[null,2.5,{"$f":"$C$3*Auslegung!$D$32*(1/xkr._vx!B31)^xkr._vx!$C$5","v":0.13723526134916419},7.1143351894996709E-2,null,null,"Austrittsgeschwindigkeit:",null,{"$f":"(Auslegung!$D$32/xkr._vx!$I$30)/3600","v":0.46677335771985973},null,{"$f":"Auslegung!$D$37-Auslegung!$D$38","v":1.2},{"$f":"K31","v":1.2},{"$f":"I31/L31","v":0.38897779809988314},{"$f":"M31","v":0.38897779809988314}]
[null,2.6,{"$f":"$C$3*Auslegung!$D$32*(1/xkr._vx!B32)^xkr._vx!$C$5","v":0.13228585552835181},6.8407069129804515E-2,null,null,"Archimedes-Zahl",null,{"$f":"(9.81*(Auslegung!D18/1000)*(Auslegung!D35-Auslegung!D34))/((273.15+Auslegung!D35)*xkr._vx!I31^2)","v":0.72245220071709237}]
[null,2.7,{"$f":"$C$3*Auslegung!$D$32*(1/xkr._vx!B33)^xkr._vx!$C$5","v":0.12769186392857906},6.5873473976848798E-2,null,null,"anisothermer Freistrahl",null,{"$f":"I31+SQRT((I32/0.2)*(2.83*(SQRT(1.2)-1)))","v":1.4545520006479111}]
[null,2.8,{"$f":"$C$3*Auslegung!$D$32*(1/xkr._vx!B34)^xkr._vx!$C$5","v":0.12341596870913803},6.3520849906247068E-2]
[null,2.9,{"$f":"$C$3*Auslegung!$D$32*(1/xkr._vx!B35)^xkr._vx!$C$5","v":0.11942592336704923},6.133047577154889E-2]
[null,3,{"$f":"$C$3*Auslegung!$D$32*(1/xkr._vx!B36)^xkr._vx!$C$5","v":0.11569371732712745},5.928612657916392E-2,null,null,null,null,null,"Maximalgeschw.","ges. Lauflänge bis vmax","Lauflänge vertikal","Wandabstand"]
[null,3.1,{"$f":"$C$3*Auslegung!$D$32*(1/xkr._vx!B37)^xkr._vx!$C$5","v":0.11219490068470164},5.7373670883061861E-2]
[null,3.2,{"$f":"$C$3*Auslegung!$D$32*(1/xkr._vx!B38)^xkr._vx!$C$5","v":0.1089080343491592},5.5580743667966177E-2,null,"Berechnung Wandabstand bei vorgegebener Max. Geschw.",null,null,null,{"$f":"Auslegung!$D$33","v":0.2},{"$f":"1/(J38/($C$3*Auslegung!$D$32))^(1/xkr._vx!$C$5)","v":1.6722126516534774},{"$f":"Auslegung!$D$37-Auslegung!$D$38","v":1.2},{"$f":"K38-L38","v":0.47221265165347748}]
[null,3.3,{"$f":"$C$3*Auslegung!$D$32*(1/xkr._vx!B39)^xkr._vx!$C$5","v":0.10581423920279671},5.3896478708330843E-2]
[null,3.4,{"$f":"$C$3*Auslegung!$D$32*(1/xkr._vx!B40)^xkr._vx!$C$5","v":0.10289682405460557},5.231128815808582E-2]
[null,3.5,{"$f":"$C$3*Auslegung!$D$32*(1/xkr._vx!B41)^xkr._vx!$C$5","v":0.10014097675811544},5.0816679924997644E-2]
[null,3.6,{"$f":"$C$3*Auslegung!$D$32*(1/xkr._vx!B42)^xkr._vx!$C$5","v":9.7533506311574411E-2},4.9405105482636609E-2]
[null,3.7,{"$f":"$C$3*Auslegung!$D$32*(1/xkr._vx!B43)^xkr._vx!$C$5","v":9.5062626374077808E-2},4.8069832361484259E-2]
[null,3.8,{"$f":"$C$3*Auslegung!$D$32*(1/xkr._vx!B44)^xkr._vx!$C$5","v":9.2717772631002546E-2},4.6804836773024147E-2]
[null,3.9,{"$f":"$C$3*Auslegung!$D$32*(1/xkr._vx!B45)^xkr._vx!$C$5","v":9.0489447983227611E-2},4.5604712753203026E-2]
[null,4,{"$f":"$C$3*Auslegung!$D$32*(1/xkr._vx!B46)^xkr._vx!$C$5","v":8.8369090731154884E-2},4.4464594934372943E-2]
[null,4.0999999999999996,{"$f":"$C$3*Auslegung!$D$32*(1/xkr._vx!B47)^xkr._vx!$C$5","v":8.6348961860063939E-2},4.3380092618900433E-2]
[null,4.2,{"$f":"$C$3*Auslegung!$D$32*(1/xkr._vx!B48)^xkr._vx!$C$5","v":8.4422048269640351E-2},4.2347233270831369E-2]
[null,4.3,{"$f":"$C$3*Auslegung!$D$32*(1/xkr._vx!B49)^xkr._vx!$C$5","v":8.2581979373685388E-2},4.1362413892439949E-2]
[null,4.4000000000000004,{"$f":"$C$3*Auslegung!$D$32*(1/xkr._vx!B50)^xkr._vx!$C$5","v":8.0822954960645468E-2},4.0422359031248127E-2]
[null,4.5,{"$f":"$C$3*Auslegung!$D$32*(1/xkr._vx!B51)^xkr._vx!$C$5","v":7.9139682577897219E-2},3.9524084386109277E-2]
[null,4.5999999999999996,{"$f":"$C$3*Auslegung!$D$32*(1/xkr._vx!B52)^xkr._vx!$C$5","v":7.7527323002637566E-2},3.8664865160324302E-2]
[null,4.7,{"$f":"$C$3*Auslegung!$D$32*(1/xkr._vx!B53)^xkr._vx!$C$5","v":7.5981442605080052E-2},3.7842208454785482E-2]
[null,4.8,{"$f":"$C$3*Auslegung!$D$32*(1/xkr._vx!B54)^xkr._vx!$C$5","v":7.4497971607264166E-2},3.7053829111977452E-2]
[null,4.9000000000000004,{"$f":"$C$3*Auslegung!$D$32*(1/xkr._vx!B55)^xkr._vx!$C$5","v":7.3073167402325889E-2},3.6297628517855458E-2]
[null,5,{"$f":"$C$3*Auslegung!$D$32*(1/xkr._vx!B56)^xkr._vx!$C$5","v":7.1703582231730692E-2},3.5571675947498355E-2]
[null,5.0999999999999996,{"$f":"$C$3*Auslegung!$D$32*(1/xkr._vx!B57)^xkr._vx!$C$5","v":7.0386034627360289E-2},3.4874192105390549E-2]
[null,5.2,{"$f":"$C$3*Auslegung!$D$32*(1/xkr._vx!B58)^xkr._vx!$C$5","v":6.9117584115926556E-2},3.4203534564902258E-2]
[null,5.3,{"$f":"$C$3*Auslegung!$D$32*(1/xkr._vx!B59)^xkr._vx!$C$5","v":6.789550875848252E-2},3.3558184856130525E-2]
[null,5.4,{"$f":"$C$3*Auslegung!$D$32*(1/xkr._vx!B60)^xkr._vx!$C$5","v":6.6717285160630455E-2},3.2936736988424399E-2]
[null,5.5,{"$f":"$C$3*Auslegung!$D$32*(1/xkr._vx!B61)^xkr._vx!$C$5","v":6.5580570641641245E-2},3.2337887224998502E-2]
[null,5.6,{"$f":"$C$3*Auslegung!$D$32*(1/xkr._vx!B62)^xkr._vx!$C$5","v":6.4483187294912203E-2},3.1760424953123534E-2]
[null,5.7,{"$f":"$C$3*Auslegung!$D$32*(1/xkr._vx!B63)^xkr._vx!$C$5","v":6.3423107709468365E-2},3.1203224515349431E-2]
[null,5.8,{"$f":"$C$3*Auslegung!$D$32*(1/xkr._vx!B64)^xkr._vx!$C$5","v":6.239844215374267E-2},3.0665237885774445E-2]
[null,5.8999999999999897,{"$f":"$C$3*Auslegung!$D$32*(1/xkr._vx!B65)^xkr._vx!$C$5","v":6.1407427049622564E-2},3.0145488091100354E-2]
[null,6,{"$f":"$C$3*Auslegung!$D$32*(1/xkr._vx!B66)^xkr._vx!$C$5","v":6.0448414587515278E-2},2.964306328958196E-2]

{"sheet":"Eingabe","index":8,"n_rows":50,"n_cols":20,"rows_kept":50,"cut":false,"hidden":true,"merged":[]}
[]
[null,null,null,null,1,"= Produktgruppe emcoair"]
[null,null,null,null,null,"KSW","Artikel"]
[null,null,null,null,null,null,1,"Schlitzanzahl","1 Schlitz "]
[null,null,null,null,null,null,2,null,"2 Schlitze"]
[null,null,null,null,null,null,"X",null,"Sonder"]
[null,null,null,null,null,null,null,"K","Funktion","Zuluft / Abluft Kombination"]
[null,null,null,null,null,null,null,"Z",null,"Zuluft"]
[null,null,null,null,null,null,null,"A",null,"Abluft"]
[null,null,null,null,null,null,null,null,"0500","Breite"]
[null,null,null,null,null,null,null,null,"0600"]
[null,null,null,null,null,null,null,null,"0700"]
[null,null,null,null,null,null,null,null,"0800"]
[null,null,null,null,null,null,null,null,"0900"]
[null,null,null,null,null,null,null,null,"1000"]
[null,null,null,null,null,null,null,null,"1100"]
[null,null,null,null,null,null,null,null,"1200"]
[null,null,null,null,null,null,null,null,null,"A","Werkstoff","Aluminium"]
[]
[]
[null,null,null,null,null,null,null,null,null,null,9010,"Oberfläche Luftdurchlass","RAL 9010 glänzend"]
[null,null,null,null,null,null,null,null,null,null,"E6C0",null,"Aluminium naturfarbig eloxiert"]
[null,null,null,null,null,null,null,null,null,null,"XXXX",null,"RAL-Ton **** glänzend"]
[null,null,null,null,null,null,null,null,null,null,"SSSS",null,"Sonderlackierung"]
[null,null,null,null,null,null,null,null,null,null,null,"S","Farbe Luftlenkelement","schwarz"]
[null,null,null,null,null,null,null,null,null,null,null,"W",null,"weiß"]
[null,null,null,null,null,null,null,null,null,null,null,"G",null,"grau"]
[null,null,null,null,null,null,null,null,null,null,null,null,"C","Luftlenkeinstellung","DE"]
[null,null,null,null,null,null,null,null,null,null,null,null,"S",null,"Sonder"]
[null,null,null,null,null,null,null,null,null,null,null,null,null,"V","Werkstoff Anschlusskasten","Stahl verzinkt"]
[null,null,null,null,null,null,null,null,null,null,null,null,null,0,null,"ohne Anschlusskasten"]
[null,null,null,null,null,null,null,null,null,null,null,null,null,null,1,"Drossel ","mit FBD"]
[null,null,null,null,null,null,null,null,null,null,null,null,null,null,0,null,"ohne FBD"]
[null,null,null,null,null,null,null,null,null,null,null,null,null,null,null,"B1","Innenauskleidung","Dämmung Baustoffklasse B1"]
[null,null,null,null,null,null,null,null,null,null,null,null,null,null,null,"A2",null,"Dämmung Baustoffklasse A2"]
[null,null,null,null,null,null,null,null,null,null,null,null,null,null,null,null,1,"Stutzenanzahl","1 Stutzen"]
[null,null,null,null,null,null,null,null,null,null,null,null,null,null,null,null,"x",null,"Sonder"]
[null,null,null,null,null,null,null,null,null,null,null,null,null,null,null,null,null,100,"Stutzendurchmesser","98 mm"]
[null,null,null,null,null,null,null,null,null,null,null,null,null,null,null,null,null,"080",null,"78 mm"]
[null,null,null,null,null,null,null,null,null,null,null,null,null,null,null,null,null,"xxx",null,"Sonder"]
[null,null,null,null,{"$f":"E2","v":1},{"$f":"F3","v":"KSW"},{"$f":"G4","v":1},1,{"$f":"I10","v":"0500"},{"$f":"J18","v":"A"},{"$f":"K21","v":9010},{"$f":"L25","v":"S"},{"$f":"M28","v":"C"},{"$f":"N30","v":"V"},{"$f":"O32","v":1},{"$f":"P34","v":"B1"},{"$f":"Q36","v":1},{"$f":"R38","v":100}]
[]
[]
[]
["Schwarz","S"]
["weiß","W"]
["naturfarbig eloxiert","K"]
["weiß (RAL 9010) bepulvert","L"]
["Anschlusskasten ohne Mengeneinstellung","AK1"]
["Anschlusskasten mit Mengeneinstellung*","AK2"]

{"sheet":"RS-CAP","index":9,"n_rows":69,"n_cols":18,"rows_kept":69,"cut":false,"hidden":true,"merged":[]}
["Übergabedaten:",null,"Gewählter Durchlass",null,{"$f":"CONCATENATE(Auslegung!$D$12,Auslegung!$D$18,Auslegung!$D$25)","v":"MPC-R-M600250"}]
[null,null,"Volumenstrom",null,{"$f":"Auslegung!$D$32","v":490}]
[null,null,"Temperaturdifferenz",null,{"$f":"Auslegung!$D$35-Auslegung!$D$34","v":8}]
[null,null,"MPC-R-S300","MPC-R-S300","MPC-R-S300","MPC-R-S600","MPC-R-S600","MPC-R-S600","MPC-R-S600","MPC-R-S600","MPC-R-S625","MPC-R-S625","MPC-R-S625","MPC-R-S625","MPC-R-S625"]
[null,null,100,125,160,125,160,200,225,250,125,160,200,225,250]
[null,null,{"$f":"CONCATENATE(C4,C5)","v":"MPC-R-S300100"},{"$f":"CONCATENATE(D4,D5)","v":"MPC-R-S300125"},"MPC-R-S300160","MPC-R-S600125","MPC-R-S600160","MPC-R-S600200","MPC-R-S600225","MPC-R-S600250",{"$f":"CONCATENATE(K4,K5)","v":"MPC-R-S625125"},"MPC-R-S625160","MPC-R-S625200","MPC-R-S625225","MPC-R-S625250",1]
[null,null,null,null,null,null,null,null,null,null,null,null,null,null,null,2]
["Konstante","K011",6.0288560827923378E-4,8.2456738126243916E-4,4.4953576915990865E-4,1.1215070871923583E-3,7.3911377772813971E-5,1.9911571322654478E-4,2.4088475261889276E-4,2.4088475261889276E-4,1.1215070871923583E-3,7.3911377772813971E-5,1.9911571322654478E-4,2.4088475261889276E-4,2.4088475261889276E-4,3]
[null,"K012",2.2109279157899095,2.0558808920707468,2.0422413600709786,1.9044708139682451,2.2525940011959387,1.9655065501124718,1.9842353989171235,1.9842353989171235,1.9044708139682451,2.2525940011959387,1.9655065501124718,1.9842353989171235,1.9842353989171235,4]
[null,"K021",null,null,null,null,null,null,null,null,null,null,null,null,null,5]
[null,"K022",null,null,null,null,null,null,null,null,null,null,null,null,null,6]
[null,"K031",1.0282169585881778E-3,1.0282169585881778E-3,1.0282169585881778E-3,7.5962546009835112E-4,7.5962546009835112E-4,7.5962546009835112E-4,7.5962546009835112E-4,7.5962546009835112E-4,7.5962546009835112E-4,7.5962546009835112E-4,7.5962546009835112E-4,7.5962546009835112E-4,7.5962546009835112E-4,7]
[null,"K032",1,1,1,1,1,1,1,1,1,1,1,1,1,8,null,"Annahme: Keine Dissipation im Stoß (wie auch bei Standard-Drallern)"]
[null,"K033",1.1183503396115346,1.1183503396115346,1.1183503396115346,0.91097612304677467,0.91097612304677467,0.91097612304677467,0.91097612304677467,0.91097612304677467,0.91097612304677467,0.91097612304677467,0.91097612304677467,0.91097612304677467,0.91097612304677467,9]
[null,"K034",null,null,null,null,null,null,null,null,null,null,null,null,null,10]
[null,"K041",3.7401720299601983E-3,3.7401720299601983E-3,3.7401720299601983E-3,6.1757049743381854E-4,6.1757049743381854E-4,6.1757049743381854E-4,6.1757049743381854E-4,6.1757049743381854E-4,6.1757049743381854E-4,6.1757049743381854E-4,6.1757049743381854E-4,6.1757049743381854E-4,6.1757049743381854E-4,11]
[null,"K042",0.36592129170761201,0.36592129170761201,0.36592129170761201,0.3934951057384149,0.3934951057384149,0.3934951057384149,0.3934951057384149,0.3934951057384149,0.3934951057384149,0.3934951057384149,0.3934951057384149,0.3934951057384149,0.3934951057384149,12]
[null,"K043",1.3302653690784338,1.3302653690784338,1.3302653690784338,1.5101681178690047,1.5101681178690047,1.5101681178690047,1.5101681178690047,1.5101681178690047,1.5101681178690047,1.5101681178690047,1.5101681178690047,1.5101681178690047,1.5101681178690047,13]
[null,"K051",0.31,0.31,0.31,0.31,0.31,0.31,0.31,0.31,0.31,0.31,0.31,0.31,0.31,14,null,"Achtung! Konstanten K051 und K052 aus Konstantensatz VAL DN 250 verwendet!"]
[null,"K052",1,1,1,1,1,1,1,1,1,1,1,1,1,15]
[null,"K071",null,null,null,null,null,null,null,null,null,null,null,null,null,16]
[null,"K072",null,null,null,null,null,null,null,null,null,null,null,null,null,17]
[null,"K081",null,null,null,null,null,null,null,null,null,null,null,null,null,18]
[null,"K082",null,null,null,null,null,null,null,null,null,null,null,null,null,19]
[null,"K083",null,null,null,null,null,null,null,null,null,null,null,null,null,20]
[null,"K091",null,null,null,null,null,null,null,null,null,null,null,null,null,21]
[null,"K092",null,null,null,null,null,null,null,null,null,null,null,null,null,22]
[null,"K093",null,null,null,null,null,null,null,null,null,null,null,null,null,23]
[null,"K094",null,null,null,null,null,null,null,null,null,null,null,null,null,24]
[null,"K101",null,null,null,null,null,null,null,null,null,null,null,null,null,25]
[null,"K102",null,null,null,null,null,null,null,null,null,null,null,null,null,26]
[null,"K103",null,null,null,null,null,null,null,null,null,null,null,null,null,27]
[null,"K104",null,null,null,null,null,null,null,null,null,null,null,null,null,28]
[null,"K021Abluft",null,null,null,null,null,null,null,null,null,null,null,null,null,29]
[null,"K022Abluft",null,null,null,null,null,null,null,null,null,null,null,null,null,30]
[null,"K011Abluft",null,null,null,null,null,null,null,null,null,null,null,null,null,31]
[null,"K012Abluft",null,null,null,null,null,null,null,null,null,null,null,null,null,32]
[null,null,{"$f":"IFERROR(HLOOKUP($E$1,$C$6:$O$36,P6,FALSE),\"\")","v":""}]
[null,null,{"$f":"IFERROR(HLOOKUP($E$1,$C$6:$O$36,P7,FALSE),\"\")","v":""}]
["Rückgabe","K011",""]
[null,"K012",""]
[null,"K021",""]
[null,"K022",""]
[null,"K031",""]
[null,"K032",""]
[null,"K033",""]
[null,"K034",""]
[null,"K041",""]
[null,"K042",""]
[null,"K043",""]
[null,"K051",""]
[null,"K052",""]
[null,"K071",""]
[null,"K072",""]
[null,"K081",""]
[null,"K082",""]
[null,"K083",""]
[null,"K091",""]
[null,"K092",""]
[null,"K093",""]
[null,"K094",""]
[null,"K101",""]
[null,"K102",""]
[null,"K103",""]
[null,"K104",""]
[null,"K021Abluft",""]
[null,"K022Abluft",""]
[null,"K011Abluft",""]
[null,"K012Abluft",""]

{"sheet":"RM-CAP","index":10,"n_rows":69,"n_cols":15,"rows_kept":69,"cut":false,"hidden":true,"merged":[[20,15,24,15]]}
["Übergabedaten:",null,"Gewählter Durchlass",null,{"$f":"CONCATENATE(Auslegung!$D$12,Auslegung!$D$18,Auslegung!$D$25)","v":"MPC-R-M600250"}]
[null,null,"Volumenstrom",null,{"$f":"Auslegung!$D$32","v":490}]
[null,null,"Temperaturdifferenz",null,{"$f":"Auslegung!$D$35-Auslegung!$D$34","v":8}]
[null,null,"MPC-R-M600","MPC-R-M600","MPC-R-M600","MPC-R-M600","MPC-R-M600","MPC-R-M625","MPC-R-M625","MPC-R-M625","MPC-R-M625","MPC-R-M625"]
[null,null,125,160,200,225,250,125,160,200,225,250]
[null,null,{"$f":"CONCATENATE(C4,C5,)","v":"MPC-R-M600125"},{"$f":"CONCATENATE(D4,D5,)","v":"MPC-R-M600160"},"MPC-R-M600200","MPC-R-M600225","MPC-R-M600250",{"$f":"CONCATENATE(H4,H5,)","v":"MPC-R-M625125"},{"$f":"CONCATENATE(I4,I5,)","v":"MPC-R-M625160"},"MPC-R-M625200","MPC-R-M625225","MPC-R-M625250",1]
[null,null,null,null,null,null,null,null,null,null,null,null,2]
["Konstante","K011",1.5854360622333918E-3,1.5555222428465798E-4,2.101441242806731E-4,1.5328007289155742E-4,1.5328007289155742E-4,1.5854360622333918E-3,1.5555222428465798E-4,2.101441242806731E-4,1.5328007289155742E-4,1.5328007289155742E-4,3]
[null,"K012",1.836670395647332,2.0723748351306868,1.956468106541269,1.9997125730264018,1.9997125730264018,1.836670395647332,2.0723748351306868,1.956468106541269,1.9997125730264018,1.9997125730264018,4]
[null,"K021",null,null,null,null,null,null,null,null,null,null,5]
[null,"K022",null,null,null,null,null,null,null,null,null,null,6]
[null,"K031",6.6062351377575983E-4,6.6062351377575983E-4,6.6062351377575983E-4,6.6062351377575983E-4,6.6062351377575983E-4,6.6062351377575983E-4,6.6062351377575983E-4,6.6062351377575983E-4,6.6062351377575983E-4,6.6062351377575983E-4,7]
[null,"K032",1,1,1,1,1,1,1,1,1,1,8,null,"Annahme: Keine Dissipation im Stoß (wie auch bei Standard-Drallern)"]
[null,"K033",0.93653411518802254,0.93653411518802254,0.93653411518802254,0.93653411518802254,0.93653411518802254,0.93653411518802254,0.93653411518802254,0.93653411518802254,0.93653411518802254,0.93653411518802254,9]
[null,"K034",null,null,null,null,null,null,null,null,null,null,10]
[null,"K041",6.6454867776380997E-5,6.6454867776380997E-5,6.6454867776380997E-5,6.6454867776380997E-5,6.6454867776380997E-5,6.6454867776380997E-5,6.6454867776380997E-5,6.6454867776380997E-5,6.6454867776380997E-5,6.6454867776380997E-5,11]
[null,"K042",0.47201071612740536,0.47201071612740536,0.47201071612740536,0.47201071612740536,0.47201071612740536,0.47201071612740536,0.47201071612740536,0.47201071612740536,0.47201071612740536,0.47201071612740536,12]
[null,"K043",1.8145300481212068,1.8145300481212068,1.8145300481212068,1.8145300481212068,1.8145300481212068,1.8145300481212068,1.8145300481212068,1.8145300481212068,1.8145300481212068,1.8145300481212068,13]
[null,"K051",0.31,0.31,0.31,0.31,0.31,0.31,0.31,0.31,0.31,0.31,14,null,"Achtung! Konstanten K051 und K052 aus Konstantensatz VAL DN 250 verwendet!"]
[null,"K052",1,1,1,1,1,1,1,1,1,1,15]
[null,"K071",null,null,null,null,null,null,null,null,null,null,16]
[null,"K072",null,null,null,null,null,null,null,null,null,null,17]
[null,"K081",null,null,null,null,null,null,null,null,null,null,18]
[null,"K082",null,null,null,null,null,null,null,null,null,null,19]
[null,"K083",null,null,null,null,null,null,null,null,null,null,20]
[null,"K091",null,null,null,null,null,null,null,null,null,null,21]
[null,"K092",null,null,null,null,null,null,null,null,null,null,22]
[null,"K093",null,null,null,null,null,null,null,null,null,null,23]
[null,"K094",null,null,null,null,null,null,null,null,null,null,24]
[null,"K101",null,null,null,null,null,null,null,null,null,null,25]
[null,"K102",null,null,null,null,null,null,null,null,null,null,26]
[null,"K103",null,null,null,null,null,null,null,null,null,null,27]
[null,"K104",null,null,null,null,null,null,null,null,null,null,28]
[null,"K021Abluft",null,null,null,null,null,null,null,null,null,null,29]
[null,"K022Abluft",null,null,null,null,null,null,null,null,null,null,30]
[null,"K011Abluft",null,null,null,null,null,null,null,null,null,null,31]
[null,"K012Abluft",null,null,null,null,null,null,null,null,null,null,32]
[null,null,{"$f":"IFERROR(HLOOKUP($E$1,$C$6:$L$37,M6,FALSE),\"\")","v":"MPC-R-M600250"}]
[null,null,{"$f":"IFERROR(HLOOKUP($E$1,$C$6:$L$37,M7,FALSE),\"\")","v":0}]
["Rückgabe","K011",1.5328007289155742E-4]
[null,"K012",1.9997125730264018,null,null,null,null,null,null,null,null,null,null,null,6.6794999999999997E-3]
[null,"K021",0]
[null,"K022",0]
[null,"K031",6.6062351377575983E-4]
[null,"K032",1]
[null,"K033",0.93653411518802254]
[null,"K034",0]
[null,"K041",6.6454867776380997E-5]
[null,"K042",0.47201071612740536]
[null,"K043",1.8145300481212068]
[null,"K051",0.31]
[null,"K052",1]
[null,"K071",0]
[null,"K072",0]
[null,"K081",0]
[null,"K082",0]
[null,"K083",0]
[null,"K091",0]
[null,"K092",0]
[null,"K093",0]
[null,"K094",0]
[null,"K101",0]
[null,"K102",0]
[null,"K103",0]
[null,"K104",0]
[null,"K021Abluft",0]
[null,"K022Abluft",0]
[null,"K011Abluft",0]
[null,"K012Abluft",0]

{"sheet":"RL-CAP","index":11,"n_rows":69,"n_cols":15,"rows_kept":69,"cut":false,"hidden":true,"merged":[]}
["Übergabedaten:",null,"Gewählter Durchlass",null,{"$f":"CONCATENATE(Auslegung!$D$12,Auslegung!$D$18,Auslegung!$D$25)","v":"MPC-R-M600250"}]
[null,null,"Volumenstrom",null,{"$f":"Auslegung!$D$32","v":490}]
[null,null,"Temperaturdifferenz",null,{"$f":"Auslegung!$D$35-Auslegung!$D$34","v":8}]
[null,null,"MPC-R-L600","MPC-R-L600","MPC-R-L600","MPC-R-L600","MPC-R-L600","MPC-R-L625","MPC-R-L625","MPC-R-L625","MPC-R-L625","MPC-R-L625"]
[null,null,125,160,200,225,250,125,160,200,225,250]
[null,null,{"$f":"CONCATENATE(C4,C5)","v":"MPC-R-L600125"},{"$f":"CONCATENATE(D4,D5)","v":"MPC-R-L600160"},"MPC-R-L600200","MPC-R-L600225","MPC-R-L600250",{"$f":"CONCATENATE(H4,H5)","v":"MPC-R-L625125"},{"$f":"CONCATENATE(I4,I5)","v":"MPC-R-L625160"},"MPC-R-L625200","MPC-R-L625225","MPC-R-L625250",1]
[null,null,null,null,null,null,null,null,null,null,null,null,2]
["Konstante","K011",9.5756587772302974E-4,1.4881974740012154E-4,2.0752919450988717E-4,1.6036958073333503E-4,1.6036958073333503E-4,9.5756587772302974E-4,1.4881974740012154E-4,2.0752919450988717E-4,1.6036958073333503E-4,1.6036958073333503E-4,3]
[null,"K012",1.9151458299664486,2.0793657070338334,1.9582675091983304,1.9295542417151696,1.9295542417151696,1.9151458299664486,2.0793657070338334,1.9582675091983304,1.9295542417151696,1.9295542417151696,4]
[null,"K021",null,null,null,null,null,null,null,null,null,null,5]
[null,"K022",null,null,null,null,null,null,null,null,null,null,6]
[null,"K031",8.6880844411266959E-4,8.6880844411266959E-4,8.6880844411266959E-4,8.6880844411266959E-4,8.6880844411266959E-4,8.6880844411266959E-4,8.6880844411266959E-4,8.6880844411266959E-4,8.6880844411266959E-4,8.6880844411266959E-4,7]
[null,"K032",1,1,1,1,1,1,1,1,1,1,8,null,"Annahme: Keine Dissipation im Stoß (wie auch bei Standard-Drallern)"]
[null,"K033",1.1281074762288941,1.1281074762288941,1.1281074762288941,1.1281074762288941,1.1281074762288941,1.1281074762288941,1.1281074762288941,1.1281074762288941,1.1281074762288941,1.1281074762288941,9]
[null,"K034",null,null,null,null,null,null,null,null,null,null,10]
[null,"K041",5.3482189975033198E-6,5.3482189975033198E-6,5.3482189975033198E-6,5.3482189975033198E-6,5.3482189975033198E-6,5.3482189975033198E-6,5.3482189975033198E-6,5.3482189975033198E-6,5.3482189975033198E-6,5.3482189975033198E-6,11]
[null,"K042",0.43362090077088772,0.43362090077088772,0.43362090077088772,0.43362090077088772,0.43362090077088772,0.43362090077088772,0.43362090077088772,0.43362090077088772,0.43362090077088772,0.43362090077088772,12]
[null,"K043",2.1944683937858946,2.1944683937858946,2.1944683937858946,2.1944683937858946,2.1944683937858946,2.1944683937858946,2.1944683937858946,2.1944683937858946,2.1944683937858946,2.1944683937858946,13]
[null,"K051",0.31,0.31,0.31,0.31,0.31,0.31,0.31,0.31,0.31,0.31,14,null,"Achtung! Konstanten K051 und K052 aus Konstantensatz VAL DN 250 verwendet!"]
[null,"K052",1,1,1,1,1,1,1,1,1,1,15]
[null,"K071",null,null,null,null,null,null,null,null,null,null,16]
[null,"K072",null,null,null,null,null,null,null,null,null,null,17]
[null,"K081",null,null,null,null,null,null,null,null,null,null,18]
[null,"K082",null,null,null,null,null,null,null,null,null,null,19]
[null,"K083",null,null,null,null,null,null,null,null,null,null,20]
[null,"K091",null,null,null,null,null,null,null,null,null,null,21]
[null,"K092",null,null,null,null,null,null,null,null,null,null,22]
[null,"K093",null,null,null,null,null,null,null,null,null,null,23]
[null,"K094",null,null,null,null,null,null,null,null,null,null,24]
[null,"K101",null,null,null,null,null,null,null,null,null,null,25]
[null,"K102",null,null,null,null,null,null,null,null,null,null,26]
[null,"K103",null,null,null,null,null,null,null,null,null,null,27]
[null,"K104",null,null,null,null,null,null,null,null,null,null,28]
[null,"K021Abluft",null,null,null,null,null,null,null,null,null,null,29]
[null,"K022Abluft",null,null,null,null,null,null,null,null,null,null,30]
[null,"K011Abluft"]
[null,"K012Abluft"]
[null,null,{"$f":"IFERROR(HLOOKUP($E$1,$C$6:$L$33,M6,FALSE),\"\")","v":""}]
[null,null,{"$f":"IFERROR(HLOOKUP($E$1,$C$6:$L$33,M7,FALSE),\"\")","v":""}]
["Rückgabe","K011",""]
[null,"K012",""]
[null,"K021",""]
[null,"K022",""]
[null,"K031",""]
[null,"K032",""]
[null,"K033",""]
[null,"K034",""]
[null,"K041",""]
[null,"K042",""]
[null,"K043",""]
[null,"K051",""]
[null,"K052",""]
[null,"K071",""]
[null,"K072",""]
[null,"K081",""]
[null,"K082",""]
[null,"K083",""]
[null,"K091",""]
[null,"K092",""]
[null,"K093",""]
[null,"K094",""]
[null,"K101",""]
[null,"K102",""]
[null,"K103",""]
[null,"K104",""]
[null,"K021Abluft",""]
[null,"K022Abluft",""]
[null,"K011Abluft",""]
[null,"K012Abluft",""]

{"sheet":"V-CAP","index":12,"n_rows":69,"n_cols":18,"rows_kept":69,"cut":false,"hidden":true,"merged":[]}
["Übergabedaten:",null,"Gewählter Durchlass",null,{"$f":"CONCATENATE(Auslegung!$D$12,Auslegung!$D$18,Auslegung!$D$25)","v":"MPC-R-M600250"}]
[null,null,"Volumenstrom",null,{"$f":"Auslegung!$D$32","v":490}]
[null,null,"Temperaturdifferenz",null,{"$f":"Auslegung!$D$35-Auslegung!$D$34","v":8}]
[null,null,"MPC-V300","MPC-V300","MPC-V300","MPC-V600","MPC-V600","MPC-V600","MPC-V600","MPC-V600","MPC-V625","MPC-V625","MPC-V625","MPC-V625","MPC-V625"]
[null,null,100,125,160,125,160,200,225,250,125,160,200,225,250]
[null,null,{"$f":"CONCATENATE(C4,C5)","v":"MPC-V300100"},{"$f":"CONCATENATE(D4,D5)","v":"MPC-V300125"},"MPC-V300160","MPC-V600125","MPC-V600160","MPC-V600200","MPC-V600225","MPC-V600250",{"$f":"CONCATENATE(K4,K5)","v":"MPC-V625125"},"MPC-V625160","MPC-V625200","MPC-V625225","MPC-V625250",1]
[null,null,null,null,null,null,null,null,null,null,null,null,null,null,null,2]
["Konstante","K011",1.2428245070584469E-3,2.2461851355391077E-4,1.2343375218316771E-3,9.2995319541243186E-4,2.7589450405388381E-4,2.101441242806731E-4,1.2576996978030326E-4,1.2576996978030326E-4,9.2995319541243186E-4,2.7589450405388381E-4,2.101441242806731E-4,1.2576996978030326E-4,1.2576996978030326E-4,3]
[null,"K012",2.0565635537926688,2.2854921800862922,1.8624429769326596,1.9076220956711976,1.9683728601940584,1.956468106541269,1.9810886885093517,1.9810886885093517,1.9076220956711976,1.9683728601940584,1.956468106541269,1.9810886885093517,1.9810886885093517,4]
[null,"K021",null,null,null,null,null,null,null,null,null,null,null,null,null,5]
[null,"K022",null,null,null,null,null,null,null,null,null,null,null,null,null,6]
[null,"K031",null,null,null,null,null,null,null,null,null,null,null,null,null,7]
[null,"K032",1,1,1,1,1,1,1,1,1,1,1,1,1,8,null,"Annahme: Keine Dissipation im Stoß (wie auch bei Standard-Drallern)"]
[null,"K033",null,null,null,null,null,null,null,null,null,null,null,null,null,9]
[null,"K034",null,null,null,null,null,null,null,null,null,null,null,null,null,10]
[null,"K041",null,null,null,null,null,null,null,null,null,null,null,null,null,11]
[null,"K042",null,null,null,null,null,null,null,null,null,null,null,null,null,12]
[null,"K043",null,null,null,null,null,null,null,null,null,null,null,null,null,13]
[null,"K051",null,null,null,null,null,null,null,null,null,null,null,null,null,14]
[null,"K052",1,1,1,1,1,1,1,1,1,1,1,1,1,15]
[null,"K071",null,null,null,null,null,null,null,null,null,null,null,null,null,16]
[null,"K072",null,null,null,null,null,null,null,null,null,null,null,null,null,17]
[null,"K081",null,null,null,null,null,null,null,null,null,null,null,null,null,18]
[null,"K082",null,null,null,null,null,null,null,null,null,null,null,null,null,19]
[null,"K083",null,null,null,null,null,null,null,null,null,null,null,null,null,20]
[null,"K091",null,null,null,null,null,null,null,null,null,null,null,null,null,21]
[null,"K092",null,null,null,null,null,null,null,null,null,null,null,null,null,22]
[null,"K093",null,null,null,null,null,null,null,null,null,null,null,null,null,23]
[null,"K094",null,null,null,null,null,null,null,null,null,null,null,null,null,24]
[null,"K101",null,null,null,null,null,null,null,null,null,null,null,null,null,25]
[null,"K102",null,null,null,null,null,null,null,null,null,null,null,null,null,26]
[null,"K103",null,null,null,null,null,null,null,null,null,null,null,null,null,27]
[null,"K104",null,null,null,null,null,null,null,null,null,null,null,null,null,28]
[null,"K021Abluft",null,null,null,null,null,null,null,null,null,null,null,null,null,29]
[null,"K022Abluft",null,null,null,null,null,null,null,null,null,null,null,null,null,30]
[null,"K011Abluft"]
[null,"K012Abluft"]
[null,null,{"$f":"IFERROR(HLOOKUP($E$1,$C$6:$O$37,P6,FALSE),\"\")","v":""}]
[null,null,{"$f":"IFERROR(HLOOKUP($E$1,$C$6:$O$37,P7,FALSE),\"\")","v":""}]
["Rückgabe","K011",""]
[null,"K012",""]
[null,"K021",""]
[null,"K022",""]
[null,"K031",""]
[null,"K032",""]
[null,"K033",""]
[null,"K034",""]
[null,"K041",""]
[null,"K042",""]
[null,"K043",""]
[null,"K051",""]
[null,"K052",""]
[null,"K071",""]
[null,"K072",""]
[null,"K081",""]
[null,"K082",""]
[null,"K083",""]
[null,"K091",""]
[null,"K092",""]
[null,"K093",""]
[null,"K094",""]
[null,"K101",""]
[null,"K102",""]
[null,"K103",""]
[null,"K104",""]
[null,"K021Abluft",""]
[null,"K022Abluft",""]
[null,"K011Abluft",""]
[null,"K012Abluft",""]

{"sheet":"Q-CAP","index":13,"n_rows":69,"n_cols":16,"rows_kept":69,"cut":false,"hidden":true,"merged":[]}
["Übergabedaten:",null,"Gewählter Durchlass",null,{"$f":"CONCATENATE(Auslegung!$D$12,Auslegung!$D$18,Auslegung!$D$25)","v":"MPC-R-M600250"}]
[null,null,"Volumenstrom",null,{"$f":"Auslegung!$D$32","v":490}]
[null,null,"Temperaturdifferenz",null,{"$f":"Auslegung!$D$35-Auslegung!$D$34","v":8}]
[null,null,"MPC-Q300","MPC-Q300","MPC-Q300","MPC-Q600","MPC-Q600","MPC-Q600","MPC-Q600","MPC-Q600","MPC-Q625","MPC-Q625","MPC-Q625","MPC-Q625","MPC-Q625"]
[null,null,100,125,160,125,160,200,225,250,125,160,200,225,250]
[null,null,{"$f":"CONCATENATE(C4,C5)","v":"MPC-Q300100"},{"$f":"CONCATENATE(D4,D5)","v":"MPC-Q300125"},"MPC-Q300160","MPC-Q600125","MPC-Q600160","MPC-Q600200","MPC-Q600225","MPC-Q600250",{"$f":"CONCATENATE(K4,K5)","v":"MPC-Q625125"},"MPC-Q625160","MPC-Q625200","MPC-Q625225","MPC-Q625250",1]
[null,null,null,null,null,null,null,null,null,null,null,null,null,null,null,2]
["Konstante","K011",8.2609085139599388E-4,3.5459095015917406E-4,2.8341900132904359E-5,5.6536765386093197E-4,1.990713050073781E-4,2.0943166372821255E-4,5.5986538405224954E-5,5.5986538405224954E-5,5.6536765386093197E-4,1.990713050073781E-4,2.0943166372821255E-4,5.5986538405224954E-5,5.5986538405224954E-5,3]
[null,"K012",2.0640331638295235,2.0864899652539415,2.4359535845336993,1.9719834570630876,1.9652398460434199,1.9570385375841892,1.9798138905174787,1.9798138905174787,1.9719834570630876,1.9652398460434199,1.9570385375841892,1.9798138905174787,1.9798138905174787,4]
[null,"K021",null,null,null,null,null,null,null,null,null,null,null,null,null,5]
[null,"K022",null,null,null,null,null,null,null,null,null,null,null,null,null,6]
[null,"K031",null,null,null,null,null,null,null,null,null,null,null,null,null,7]
[null,"K032",null,null,null,null,null,null,null,null,null,null,null,null,null,8]
[null,"K033",null,null,null,null,null,null,null,null,null,null,null,null,null,9]
[null,"K034",null,null,null,null,null,null,null,null,null,null,null,null,null,10]
[null,"K041",null,null,null,null,null,null,null,null,null,null,null,null,null,11]
[null,"K042",null,null,null,null,null,null,null,null,null,null,null,null,null,12]
[null,"K043",null,null,null,null,null,null,null,null,null,null,null,null,null,13]
[null,"K051",null,null,null,null,null,null,null,null,null,null,null,null,null,14]
[null,"K052",null,null,null,null,null,null,null,null,null,null,null,null,null,15]
[null,"K071",null,null,null,null,null,null,null,null,null,null,null,null,null,16]
[null,"K072",null,null,null,null,null,null,null,null,null,null,null,null,null,17]
[null,"K081",null,null,null,null,null,null,null,null,null,null,null,null,null,18]
[null,"K082",null,null,null,null,null,null,null,null,null,null,null,null,null,19]
[null,"K083",null,null,null,null,null,null,null,null,null,null,null,null,null,20]
[null,"K091",null,null,null,null,null,null,null,null,null,null,null,null,null,21]
[null,"K092",null,null,null,null,null,null,null,null,null,null,null,null,null,22]
[null,"K093",null,null,null,null,null,null,null,null,null,null,null,null,null,23]
[null,"K094",null,null,null,null,null,null,null,null,null,null,null,null,null,24]
[null,"K101",null,null,null,null,null,null,null,null,null,null,null,null,null,25]
[null,"K102",null,null,null,null,null,null,null,null,null,null,null,null,null,26]
[null,"K103",null,null,null,null,null,null,null,null,null,null,null,null,null,27]
[null,"K104",null,null,null,null,null,null,null,null,null,null,null,null,null,28]
[null,"K021Abluft",null,null,null,null,null,null,null,null,null,null,null,null,null,29]
[null,"K022Abluft",null,null,null,null,null,null,null,null,null,null,null,null,null,30]
[null,"K011Abluft",8.0121760985875205E-4,3.1609498177504131E-4,3.0755153655497017E-5,5.7461675813817779E-4,2.0752919450988717E-4,2.0804802792036192E-4,7.4224599066404339E-5,7.4224599066404339E-5,5.7461675813817779E-4,2.0752919450988717E-4,2.0804802792036192E-4,7.4224599066404339E-5,7.4224599066404339E-5,31]
[null,"K012Abluft",2.0699562315137077,2.106764031208205,2.4221155784433797,1.9692465824233614,1.9582675091983304,1.9580342897154526,1.9381232681377221,1.9381232681377221,1.9692465824233614,1.9582675091983304,1.9580342897154526,1.9381232681377221,1.9381232681377221,32]
[]
[null,null,{"$f":"IFERROR(HLOOKUP($E$1,$C$6:$O$33,P7,FALSE),\"\")","v":""}]
["Rückgabe","K011",{"$f":"IFERROR(HLOOKUP($E$1,$C$6:$O$33,P8,FALSE),\"\")","v":""}]
[null,"K012",""]
[null,"K021",""]
[null,"K022",""]
[null,"K031",""]
[null,"K032",""]
[null,"K033",""]
[null,"K034",""]
[null,"K041",""]
[null,"K042",""]
[null,"K043",""]
[null,"K051",""]
[null,"K052",""]
[null,"K071",""]
[null,"K072",""]
[null,"K081",""]
[null,"K082",""]
[null,"K083",""]
[null,"K091",""]
[null,"K092",""]
[null,"K093",""]
[null,"K094",""]
[null,"K101",""]
[null,"K102",""]
[null,"K103",""]
[null,"K104",""]
[null,"K021Abluft",""]
[null,"K022Abluft",""]
[null,"K011Abluft",""]
[null,"K012Abluft",""]